Dicinnamoyl peroxide
- Formula: C18H14O4
- Molecular weight: 294.3014
- IUPAC Standard InChIKey: YPWDLNYZZVNNKN-PHEQNACWSA-N
- CAS Registry Number: 15036-31-4
- Chemical structure:

Condensed phase thermochemistry data

Data compiled by: Hussein Y. Afeefy, Joel F. Liebman, and Stephen E. Stein
Quantity | Value | Units | Method | Reference | Comment |
---|---|---|---|---|---|
ΔfH°solid | -356.1 ± 8.4 | kJ/mol | Ccb | Breitenbach and Derkosch, 1951 | Reanalyzed by Cox and Pilcher, 1970, Original value = -354. kJ/mol |
Quantity | Value | Units | Method | Reference | Comment |
ΔcH°solid | -8727.8 ± 8.4 | kJ/mol | Ccb | Breitenbach and Derkosch, 1951 | Reanalyzed by Cox and Pilcher, 1970, Original value = -8727.4 kJ/mol; Corresponding ΔfHºsolid = -356.2 kJ/mol (simple calculation by NIST; no Washburn corrections) |

References

Breitenbach and Derkosch, 1951
Breitenbach, J.W.; Derkosch, J.,
Verbrennungswarmen von peroxyden und verwandten verbindungen sowie von polystrolen,
Monatsh. Chem., 1951, 82, 177-179. [all data]
Cox and Pilcher, 1970
Cox, J.D.; Pilcher, G.,
Thermochemistry of Organic and Organometallic Compounds, Academic Press, New York, 1970, 1-636. [all data]