Cyclodecanol
- Formula: C10H20O
- Molecular weight: 156.2652
- IUPAC Standard InChIKey: WFRBMXFCEAHLGH-UHFFFAOYSA-N
- CAS Registry Number: 1502-05-2
- Chemical structure:
View 3d structure (requires JavaScript / HTML 5) - Permanent link for this species. Use this link for bookmarking this species for future reference.

Phase change data

Data compiled as indicated in comments:
TRC - Thermodynamics Research Center, NIST Boulder Laboratories, Chris Muzny director
AC - William E. Acree, Jr., James S. Chickos
Quantity | Value | Units | Method | Reference | Comment |
---|---|---|---|---|---|
Tfus | 315. | K | N/A | Prelog, Schenker, et al., 1952 | Uncertainty assigned by TRC = 3. K; TRC |
Enthalpy of sublimation
ΔsubH (kJ/mol) | Temperature (K) | Method | Reference | Comment |
---|---|---|---|---|
100.5 ± 0.5 | 288. | TM | Engelsman, 1955 | Based on data from 287. to 292. K.; AC |

References

Prelog, Schenker, et al., 1952
Prelog, V.; Schenker, K.; Guenthard, H.H.,
Carbon Rings. LX. The Ten-membered Ring,
Helv. Chim. Acta, 1952, 35, 1598. [all data]
Engelsman, 1955
Engelsman, J.J.,
, Ph.D. Thesis, Vrije Universiteit Te Amsterdam, 1955. [all data]