Pentanedioic acid, monomethyl ester
- Formula: C6H10O4
- Molecular weight: 146.1412
- IUPAC Standard InChIKey: IBMRTYCHDPMBFN-UHFFFAOYSA-N
- CAS Registry Number: 1501-27-5
- Chemical structure:
View 3d structure (requires JavaScript / HTML 5) - Other names: Glutaric acid, monomethyl ester; Methyl hydrogen glutarate; Monomethyl glutarate; Methyl glutarate,mono; Monomethyl ester of glutaric acid

Phase change data

Data compiled by: Robert L. Brown and Stephen E. Stein
Reduced pressure boiling point
Tboil (K) | Pressure (bar) | Reference |
---|---|---|
423.7 | 0.013 | Weast and Grasselli, 1989 |
431. to 438. | 0.031 | Frinton Laboratories Inc., 1986 |

References

Weast and Grasselli, 1989
CRC Handbook of Data on Organic Compounds, 2nd Editon, Weast,R.C and Grasselli, J.G., ed(s)., CRC Press, Inc., Boca Raton, FL, 1989, 1. [all data]
Frinton Laboratories Inc., 1986
Frinton Laboratories Inc.,
Catalog Number 11, Frinton Laboratories Inc., Vineland, NJ, 1986, 99. [all data]