Diethyl 2-acetylglutarate
- Formula: C11H18O5
- Molecular weight: 230.2576
- IUPAC Standard InChIKey: NNOGMCQLKMLNPL-UHFFFAOYSA-N
- CAS Registry Number: 1501-06-0
- Chemical structure:
View 3d structure (requires JavaScript / HTML 5) - Other names: Diethyl α-acetoglutarate; Diethyl α-acetylglutarate; Pentanedioic acid, 2-acetyl-, diethyl ester; 2-Acetylglutaric acid, diethyl ester

Phase change data

Data compiled by: Robert L. Brown and Stephen E. Stein
Quantity | Value | Units | Method | Reference | Comment |
---|---|---|---|---|---|
Tboil | 544. to 545. | K | N/A | Buckingham and Donaghy, 1982 |
Reduced pressure boiling point
Tboil (K) | Pressure (bar) | Reference |
---|---|---|
427.2 | 0.015 | Aldrich Chemical Company Inc., 1990 |
442. to 444. | 0.029 | Frinton Laboratories Inc., 1986 |
435. | 0.015 | Buckingham and Donaghy, 1982 |

References

Buckingham and Donaghy, 1982
Buckingham, J.; Donaghy, S.M.,
Dictionary of Organic Compounds: Fifth Edition, Chapman and Hall, New York, 1982, 1. [all data]
Aldrich Chemical Company Inc., 1990
Aldrich Chemical Company Inc.,
Catalog Handbook of Fine Chemicals, Aldrich Chemical Company, Inc., Milwaukee WI, 1990, 1. [all data]
Frinton Laboratories Inc., 1986
Frinton Laboratories Inc.,
Catalog Number 11, Frinton Laboratories Inc., Vineland, NJ, 1986, 99. [all data]