Benzoic acid, 3,4,5-trihydroxy-
- Formula: C7H6O5
- Molecular weight: 170.1195
- IUPAC Standard InChIKey: LNTHITQWFMADLM-UHFFFAOYSA-N
- CAS Registry Number: 149-91-7
- Chemical structure:
View 3d structure (requires JavaScript / HTML 5) - Other names: Gallic acid; 3,4,5-Trihydroxybenzoic acid; Kyselina gallova; Kyselina 3,4,5-trihydroxybenzoova

Condensed phase thermochemistry data

Data compiled by: Hussein Y. Afeefy, Joel F. Liebman, and Stephen E. Stein
Quantity | Value | Units | Method | Reference | Comment |
---|---|---|---|---|---|
ΔfH°solid | -1013. ± 5.0 | kJ/mol | Ccb | Lobanov and Karmanova, 1971 | |
Quantity | Value | Units | Method | Reference | Comment |
ΔcH°solid | -2600. ± 5.0 | kJ/mol | Ccb | Lobanov and Karmanova, 1971 | Corresponding ΔfHºsolid = -1013. kJ/mol (simple calculation by NIST; no Washburn corrections) |

Phase change data

Data compiled by: William E. Acree, Jr., James S. Chickos
Enthalpy of sublimation
ΔsubH (kJ/mol) | Temperature (K) | Reference | Comment |
---|---|---|---|
75.1 | 406. | Hirsbrunner, 1934 | Based on data from 391. to 421. K. |

Reaction thermochemistry data

Data compiled by: Hussein Y. Afeefy, Joel F. Liebman, and Stephen E. Stein
Individual Reactions
By formula: C10H12O5 + H2O = C7H6O5 + C3H8O
Quantity | Value | Units | Method | Reference | Comment |
---|---|---|---|---|---|
ΔrH° | -15.4 ± 6.6 | kJ/mol | Eqk | Tewari, Schantz, et al., 1996 | liquid phase; solvent: Toluene |

Normal alkane RI, non-polar column, isothermal

Column type | Active phase | Temperature (C) | I | Reference | Comment |
---|---|---|---|---|---|
Packed | Apieson L | 140. | 1754. | Hedin, Minyard, et al., 1967 | Nitrogen, Chromosorb W HMDS (60-80 mesh); Column length: 1.8 m |

References

Lobanov and Karmanova, 1971
Lobanov, G.A.; Karmanova, L.P.,
Enthalpy of formation of some organic substances,
Izv. Vyssh. Uchebn. Zaved., Khim. Khim. Tekhnol., 1971, 14, 865-867. [all data]
Hirsbrunner, 1934
Hirsbrunner, H.,
Uber das gleichgewicht der thermischen dissoziation der salicylsaure,
Helv. Chim. Acta, 1934, 17, 477-504. [all data]
Tewari, Schantz, et al., 1996
Tewari, Y.B.; Schantz, M.M.; Rekharsky, M.V.; Goldberg, R.N.,
Thermodynamics of the hydrolysis of 3,4,5-trihydroxybenzoic acid propyl ester (n-propylgallate) to 3,4,5-trihydroxybenzoic acid (gallic acid) and propan-1-ol in aqueous media and in toluene,
J. Chem. Thermodyn., 1996, 28, 171-185. [all data]
Hedin, Minyard, et al., 1967
Hedin, P.A.; Minyard, J.P.; Thompson, A.C.,
Chromatographic and spectral analysis of phenolic acids and related compounds,
J. Chromatogr., 1967, 30, 43-53, https://doi.org/10.1016/S0021-9673(00)84111-4
. [all data]