cis-2,4,6-Trimethyl-1,3,5-trioxane
- Formula: C6H12O3
- Molecular weight: 132.1577
- IUPAC Standard InChIKey: SQYNKIJPMDEDEG-FPFOFBBKSA-N
- CAS Registry Number: 1499-02-1
- Chemical structure:
View 3d structure (requires JavaScript / HTML 5) - Stereoisomers:

Gas phase thermochemistry data

Data compiled by: Hussein Y. Afeefy, Joel F. Liebman, and Stephen E. Stein
Quantity | Value | Units | Method | Reference | Comment |
---|---|---|---|---|---|
ΔfH°gas | -636.2 ± 3.0 | kJ/mol | Ccb | Pihlaja and Tuomi, 1970 |

Condensed phase thermochemistry data

Data compiled by: Hussein Y. Afeefy, Joel F. Liebman, and Stephen E. Stein
Quantity | Value | Units | Method | Reference | Comment |
---|---|---|---|---|---|
ΔfH°liquid | -681.8 ± 2.6 | kJ/mol | Ccb | Pihlaja and Tuomi, 1970 | |
Quantity | Value | Units | Method | Reference | Comment |
ΔcH°liquid | -3394.2 ± 2.6 | kJ/mol | Ccb | Pihlaja and Tuomi, 1970 | Corresponding ΔfHºliquid = -681.82 kJ/mol (simple calculation by NIST; no Washburn corrections) |

Phase change data

Data compiled by: Donald R. Burgess, Jr.
Quantity | Value | Units | Method | Reference | Comment |
---|---|---|---|---|---|
ΔvapH° | 45.6 | kJ/mol | N/A | Pihlaja and Tuomi, 1970 |

References

Pihlaja and Tuomi, 1970
Pihlaja, K.; Tuomi, M.,
Bond-Bond interactions in organic oxygen compounds. Part II. Anomalous stablization in cis-2,4,6-trimethyl-1,3,5-trioxane,
Suom. Kemistil., 1970, 43, 224-226. [all data]