4-Butoxybenzoic acid
- Formula: C11H14O3
- Molecular weight: 194.2271
- IUPAC Standard InChIKey: LAUFPZPAKULAGB-UHFFFAOYSA-N
- CAS Registry Number: 1498-96-0
- Chemical structure:
View 3d structure (requires JavaScript / HTML 5) - Other names: p-Butoxybenzoic acid; p-n-Butoxybenzoic acid; 4-n-Butoxybenzoic acid; Benzoic acid, 4-butoxy-; p-n-Butyloxybenzoic acid; p-Butyloxybenzoic acid; Benzoic acid, p-butoxy-; 4-Butyloxybenzoic acid

Phase change data

Data compiled as indicated in comments:
TRC - Thermodynamics Research Center, NIST Boulder Laboratories, Chris Muzny director
AC - William E. Acree, Jr., James S. Chickos
CAL - James S. Chickos, William E. Acree, Jr., Joel F. Liebman, Students of Chem 202 (Introduction to the Literature of Chemistry), University of Missouri -- St. Louis
Quantity | Value | Units | Method | Reference | Comment |
---|---|---|---|---|---|
Tfus | 420.9 | K | N/A | Armstrong, James, et al., 1979 | Uncertainty assigned by TRC = 0.5 K; TRC |
Tfus | 420.7 | K | N/A | Herbert, 1967 | Nemactic liquid crystal phase; Uncertainty assigned by TRC = 0.1 K; TRC |
Quantity | Value | Units | Method | Reference | Comment |
ΔsubH° | 129.0 ± 0.8 | kJ/mol | N/A | Ribeiro da Silva, Lobo Ferreira, et al., 2010 | AC |
Entropy of fusion
ΔfusS (J/mol*K) | Temperature (K) | Reference | Comment |
---|---|---|---|
44.8 | 420.7 | Herbert, 1967 | CAL |
6.78 | 432.2 |

References

Armstrong, James, et al., 1979
Armstrong, N.A.; James, K.C.; Wong, C.K.,
Inter-relationships between solubilities, distribution coefficients and melting points of some substituted benzoic and phenylacetic acids,
J. Pharm. Pharmacol., 1979, 31, 1, 627, https://doi.org/10.1111/j.2042-7158.1979.tb13606.x
. [all data]
Herbert, 1967
Herbert, A.J.,
Transition temperatures and transition energies of the p-n-alkoxy benzoic acids, from n-propyl to n-octadecyl,
Trans. Faraday Soc., 1967, 63, 555, https://doi.org/10.1039/tf9676300555
. [all data]
Ribeiro da Silva, Lobo Ferreira, et al., 2010
Ribeiro da Silva, Manuel A.V.; Lobo Ferreira, Ana I.M.C.; Maciel, Fabrice M.,
Experimental standard molar enthalpies of formation of some 4-alkoxybenzoic acids,
The Journal of Chemical Thermodynamics, 2010, 42, 2, 220-224, https://doi.org/10.1016/j.jct.2009.08.007
. [all data]