Zirconium chloride
- Formula: ClZr
- Molecular weight: 126.677
- CAS Registry Number: 14989-34-5

Gas phase thermochemistry data

Quantity | Value | Units | Method | Reference | Comment |
---|---|---|---|---|---|
ΔfH°gas | 205.43 | kJ/mol | Review | Chase, 1998 | Data last reviewed in December, 1969 |
Quantity | Value | Units | Method | Reference | Comment |
S°gas,1 bar | 254.31 | J/mol*K | Review | Chase, 1998 | Data last reviewed in December, 1969 |
Gas Phase Heat Capacity (Shomate Equation)
Cp° = A + B*t + C*t2 + D*t3 +
E/t2
H° − H°298.15= A*t + B*t2/2 +
C*t3/3 + D*t4/4 − E/t + F − H
S° = A*ln(t) + B*t + C*t2/2 + D*t3/3 −
E/(2*t2) + G
Cp = heat capacity (J/mol*K)
H° = standard enthalpy (kJ/mol)
S° = standard entropy (J/mol*K)
t = temperature (K) / 1000.
View plot Requires a JavaScript / HTML 5 canvas capable browser.
Temperature (K) | 298. to 1600. | 1600. to 6000. |
---|---|---|
A | 37.43052 | 48.91933 |
B | -4.217639 | -2.269414 |
C | 9.697090 | 0.358848 |
D | -3.214970 | -0.016945 |
E | -0.172282 | -9.894157 |
F | 193.8041 | 174.3577 |
G | 299.4920 | 296.6594 |
H | 205.4344 | 205.4344 |
Reference | Chase, 1998 | Chase, 1998 |
Comment | Data last reviewed in December, 1969 | Data last reviewed in December, 1969 |

Constants of diatomic molecules

Data compiled by: Klaus P. Huber and Gerhard H. Herzberg
Data collected through July, 1975
Symbol | Meaning |
---|---|
State | electronic state and / or symmetry symbol |
Te | minimum electronic energy (cm-1) |
ωe | vibrational constant – first term (cm-1) |
ωexe | vibrational constant – second term (cm-1) |
ωeye | vibrational constant – third term (cm-1) |
Be | rotational constant in equilibrium position (cm-1) |
αe | rotational constant – first term (cm-1) |
γe | rotation-vibration interaction constant (cm-1) |
De | centrifugal distortion constant (cm-1) |
βe | rotational constant – first term, centrifugal force (cm-1) |
re | internuclear distance (Å) |
Trans. | observed transition(s) corresponding to electronic state |
ν00 | position of 0-0 band (units noted in table) |
State | Te | ωe | ωexe | ωeye | Be | αe | γe | De | βe | re | Trans. | ν00 |
---|---|---|---|---|---|---|---|---|---|---|---|---|
System A: 1 | R | 35231.7 H | ||||||||||
↳missing citation | ||||||||||||
System A: | R | 34816.4 H | ||||||||||
↳missing citation | ||||||||||||
R | 34354.6 H | |||||||||||
↳missing citation | ||||||||||||
System B: 2 | (26918) | |||||||||||
↳missing citation | ||||||||||||
State | Te | ωe | ωexe | ωeye | Be | αe | γe | De | βe | re | Trans. | ν00 |
System C: 3 | R | 24704.6 H | ||||||||||
↳missing citation | ||||||||||||
System C: | R | 24530.4 H | ||||||||||
↳missing citation | ||||||||||||
R | 24343.8 H | |||||||||||
↳missing citation | ||||||||||||
R | (24155) | |||||||||||
↳missing citation |

References

Chase, 1998
Chase, M.W., Jr.,
NIST-JANAF Themochemical Tables, Fourth Edition,
J. Phys. Chem. Ref. Data, Monograph 9, 1998, 1-1951. [all data]