Strontium monochloride
- Formula: ClSr
- Molecular weight: 123.07
- IUPAC Standard InChIKey: XFDAMOCMNCFGMN-UHFFFAOYSA-M
- CAS Registry Number: 14989-33-4
- Chemical structure:
View 3d structure (requires JavaScript / HTML 5) - Permanent link for this species. Use this link for bookmarking this species for future reference.

Gas phase thermochemistry data

Quantity | Value | Units | Method | Reference | Comment |
---|---|---|---|---|---|
ΔfH°gas | -123.85 | kJ/mol | Review | Chase, 1998 | Data last reviewed in December, 1972 |
Quantity | Value | Units | Method | Reference | Comment |
S°gas,1 bar | 252.28 | J/mol*K | Review | Chase, 1998 | Data last reviewed in December, 1972 |
Gas Phase Heat Capacity (Shomate Equation)
Cp° = A + B*t + C*t2 + D*t3 +
E/t2
H° − H°298.15= A*t + B*t2/2 +
C*t3/3 + D*t4/4 − E/t + F − H
S° = A*ln(t) + B*t + C*t2/2 + D*t3/3 −
E/(2*t2) + G
Cp = heat capacity (J/mol*K)
H° = standard enthalpy (kJ/mol)
S° = standard entropy (J/mol*K)
t = temperature (K) / 1000.
View plot Requires a JavaScript / HTML 5 canvas capable browser.
Temperature (K) | 298. to 1500. | 1500. to 6000. |
---|---|---|
A | 37.08505 | 48.58042 |
B | 1.254719 | -8.589586 |
C | -0.600262 | 2.447891 |
D | 0.167540 | -0.160674 |
E | -0.103054 | -5.739360 |
F | -135.2993 | -148.2408 |
G | 296.2347 | 302.0266 |
H | -123.8460 | -123.8460 |
Reference | Chase, 1998 | Chase, 1998 |
Comment | Data last reviewed in December, 1972 | Data last reviewed in December, 1972 |

Gas phase ion energetics data

Data compiled as indicated in comments:
LL - Sharon G. Lias and Joel F. Liebman
LBLHLM - Sharon G. Lias, John E. Bartmess, Joel F. Liebman, John L. Holmes, Rhoda D. Levin, and W. Gary Mallard
LLK - Sharon G. Lias, Rhoda D. Levin, and Sherif A. Kafafi
RDSH - Henry M. Rosenstock, Keith Draxl, Bruce W. Steiner, and John T. Herron
Ionization energy determinations
IE (eV) | Method | Reference | Comment |
---|---|---|---|
5.51 ± 0.06 | EVAL | Belyaev, Gotkis, et al., 1990 | LL |
5.27 ± 0.13 | CI | Meyer, Schulze, et al., 1984 | LBLHLM |
5.10 ± 0.06 | EI | Loginov and Mittsev, 1971 | LLK |
5.59 ± 0.10 | EI | Hildenbrand, 1970 | RDSH |
5.3 ± 0.5 | EI | Hildenbrand, 1970, 2 | RDSH |

Constants of diatomic molecules

Data compiled by: Klaus P. Huber and Gerhard H. Herzberg
Data collected through September, 1977
Symbol | Meaning |
---|---|
State | electronic state and / or symmetry symbol |
Te | minimum electronic energy (cm-1) |
ωe | vibrational constant – first term (cm-1) |
ωexe | vibrational constant – second term (cm-1) |
ωeye | vibrational constant – third term (cm-1) |
Be | rotational constant in equilibrium position (cm-1) |
αe | rotational constant – first term (cm-1) |
γe | rotation-vibration interaction constant (cm-1) |
De | centrifugal distortion constant (cm-1) |
βe | rotational constant – first term, centrifugal force (cm-1) |
re | internuclear distance (Å) |
Trans. | observed transition(s) corresponding to electronic state |
ν00 | position of 0-0 band (units noted in table) |
State | Te | ωe | ωexe | ωeye | Be | αe | γe | De | βe | re | Trans. | ν00 |
---|---|---|---|---|---|---|---|---|---|---|---|---|
H 2Σ+ | 34256.7 | 364.6 H | 1.08 | H → B | 18562.7 H | |||||||
↳Novikov and Gurvich, 1965 | ||||||||||||
H ↔ X V | 34287.8 H | |||||||||||
↳Harrington, 1942; Novikov and Gurvich, 1965 | ||||||||||||
G (2Δ) | 34085.4 | 356.7 H | 1.0 | G → A | 18996.4 H | |||||||
↳Novikov and Gurvich, 1965 | ||||||||||||
34059.6 | 356.7 H | 1.0 | G → A | 19264.8 H | ||||||||
↳Novikov and Gurvich, 1965 | ||||||||||||
State | Te | ωe | ωexe | ωeye | Be | αe | γe | De | βe | re | Trans. | ν00 |
F (2Π) | 32974.8 | 354.2 H | 1.09 | F → B | 17277.5 H | |||||||
↳Novikov and Gurvich, 1965 | ||||||||||||
32905.9 | 354.2 H | 1.09 | F → B | 17208.4 H | ||||||||
↳Novikov and Gurvich, 1965 | ||||||||||||
F → A | 17884.6 H | |||||||||||
↳Novikov and Gurvich, 1965 | ||||||||||||
F → A | 18109.9 H | |||||||||||
↳Novikov and Gurvich, 1965 | ||||||||||||
State | Te | ωe | ωexe | ωeye | Be | αe | γe | De | βe | re | Trans. | ν00 |
E 2Σ+ | 32201.8 | 346.3 H | 1.10 | E → A | 17396.1 H | |||||||
↳Novikov and Gurvich, 1965 | ||||||||||||
E ↔ X V | 32223.8 H | |||||||||||
↳Harrington, 1942; Novikov and Gurvich, 1965 | ||||||||||||
D 2Σ+ | 28822.9 | 344.8 H | 1.04 | D → B | 13123.7 H | |||||||
↳Novikov and Gurvich, 1965 | ||||||||||||
D → A | 13727.0 H | |||||||||||
↳Novikov and Gurvich, 1965 | ||||||||||||
D → A | 14021.8 H | |||||||||||
↳Novikov and Gurvich, 1965 | ||||||||||||
D ↔ X V | 28844.1 H | |||||||||||
↳Harrington, 1942; Novikov and Gurvich, 1965 | ||||||||||||
State | Te | ωe | ωexe | ωeye | Be | αe | γe | De | βe | re | Trans. | ν00 |
C 2Π | 25399.8 | 283.4 H | 0.92 | C ↔ X 1 R | 25390.4 H | |||||||
↳Parker, 1935; More and Cornell, 1938; Novikov and Gurvich, 1965 | ||||||||||||
25244.6 | 282.1 H | 0.89 | C ↔ X 1 R | 25234.5 H | ||||||||
↳Parker, 1935; More and Cornell, 1938; Novikov and Gurvich, 1965 | ||||||||||||
B 2Σ+ | 15719.5 | 306.4 H | 0.98 | B ↔ X 1 V | 15721.5 2 H | |||||||
↳Parker, 1935; missing citation; Harrington, 1942; Singh, Nair, et al., 1970 | ||||||||||||
15719.5 | 306.4 H | 0.98 | B ↔ X 1 V | 15713.1 2 H | ||||||||
↳Parker, 1935; missing citation; Harrington, 1942; Singh, Nair, et al., 1970 | ||||||||||||
State | Te | ωe | ωexe | ωeye | Be | αe | γe | De | βe | re | Trans. | ν00 |
A 2Π | 15112.6 | 309.4 H | 0.98 | A ↔ X 1 V | 15116.1 H | |||||||
↳Parker, 1935; More and Cornell, 1938; missing citation; Harrington, 1942; Novikov and Gurvich, 1965; Singh, Nair, et al., 1970 | ||||||||||||
14818.4 | 309.4 H | 0.98 | A ↔ X 1 V | 14821.9 H | ||||||||
↳Parker, 1935; More and Cornell, 1938; missing citation; Harrington, 1942; Novikov and Gurvich, 1965; Singh, Nair, et al., 1970 | ||||||||||||
X 2Σ+ | 0 | 302.3 H | 0.95 |

References

Chase, 1998
Chase, M.W., Jr.,
NIST-JANAF Themochemical Tables, Fourth Edition,
J. Phys. Chem. Ref. Data, Monograph 9, 1998, 1-1951. [all data]