DL-Proline, 5-oxo-

Phase change data

Data compiled by: William E. Acree, Jr., James S. Chickos

Enthalpy of sublimation

ΔsubH (kJ/mol) Temperature (K) Method Reference Comment
133. ± 1.405.TE,MEde Kruif, Voogd, et al., 1979Based on data from 394. - 416. K.

References

de Kruif, Voogd, et al., 1979
de Kruif, C.G.; Voogd, J.; Offringa, J.C.A., Enthalpies of sublimation and vapour pressures of 14 amino acids and peptides, The Journal of Chemical Thermodynamics, 1979, 11, 7, 651-656, https://doi.org/10.1016/0021-9614(79)90030-2 . [all data]