Anthracene, 9-butyl-
- Formula: C18H18
- Molecular weight: 234.3355
- IUPAC Standard InChIKey: VNCDUSIZHQJFOG-UHFFFAOYSA-N
- CAS Registry Number: 1498-69-7
- Chemical structure:
View 3d structure (requires JavaScript / HTML 5) - Other names: 9-Butylanthracene

Phase change data

Data compiled as indicated in comments:
TRC - Thermodynamics Research Center, NIST Boulder Laboratories, Chris Muzny director
AC - William E. Acree, Jr., James S. Chickos
Quantity | Value | Units | Method | Reference | Comment |
---|---|---|---|---|---|
Tfus | 322.05 | K | N/A | Anonymous, 1968 | Uncertainty assigned by TRC = 0.5 K; TRC |
Enthalpy of vaporization
ΔvapH (kJ/mol) | Temperature (K) | Method | Reference | Comment |
---|---|---|---|---|
77.1 | 437. | A | Stephenson and Malanowski, 1987 | Based on data from 422. to 492. K.; AC |
83.9 | 343. | A | Stephenson and Malanowski, 1987 | Based on data from 328. to 373. K. See also Morecroft, 1964.; AC |
Enthalpy of sublimation
ΔsubH (kJ/mol) | Temperature (K) | Method | Reference | Comment |
---|---|---|---|---|
108.1 | 303. | A | Stephenson and Malanowski, 1987 | Based on data from 293. to 313. K. See also Morecroft, 1964.; AC |

References

Anonymous, 1968
Anonymous, R.,
Properties of hydrocarbon of high molecular weight, Am. Pet. Inst. Res. Proj. 42, Penn. State Univ., 1968. [all data]
Stephenson and Malanowski, 1987
Stephenson, Richard M.; Malanowski, Stanislaw,
Handbook of the Thermodynamics of Organic Compounds, 1987, https://doi.org/10.1007/978-94-009-3173-2
. [all data]
Morecroft, 1964
Morecroft, D.W.,
Vapor Pressures of Some High Molecular Weight Hydrocarbons.,
J. Chem. Eng. Data, 1964, 9, 4, 488-490, https://doi.org/10.1021/je60023a003
. [all data]