3-Heptanol, 4-methyl-
- Formula: C8H18O
- Molecular weight: 130.2279
- IUPAC Standard InChIKey: BKQICAFAUMRYLZ-UHFFFAOYSA-N
- CAS Registry Number: 14979-39-6
- Chemical structure:
View 3d structure (requires JavaScript / HTML 5) - Other names: 4-Methyl-3-heptanol; 4-Methyl-5-heptanol; 4-methylheptan-3-ol

Condensed phase thermochemistry data

Data compiled by: Eugene S. Domalski and Elizabeth D. Hearing
Constant pressure heat capacity of liquid
Cp,liquid (J/mol*K) | Temperature (K) | Reference | Comment |
---|---|---|---|
309.2 | 298.5 | Cline and Andrews, 1931 | T = 102 to 298 K. Value is unsmoothed experimental datum. |

Phase change data

Data compiled as indicated in comments:
TRC - Thermodynamics Research Center, NIST Boulder Laboratories, Chris Muzny director
BS - Robert L. Brown and Stephen E. Stein
AC - William E. Acree, Jr., James S. Chickos
Quantity | Value | Units | Method | Reference | Comment |
---|---|---|---|---|---|
Tboil | 428.15 | K | N/A | Kallina and Kuffner, 1960 | Uncertainty assigned by TRC = 5. K; TRC |
Tboil | 428.55 | K | N/A | Dorough, Glass, et al., 1941 | Uncertainty assigned by TRC = 0.7 K; TRC |
Quantity | Value | Units | Method | Reference | Comment |
Tc | 623.5 ± 0.5 | K | N/A | Gude and Teja, 1995 | |
Tc | 623.5 | K | N/A | Lawrenson and Lee, 1978 | Uncertainty assigned by TRC = 0.5 K; Visual, decomp.; TRC |
Reduced pressure boiling point
Tboil (K) | Pressure (bar) | Reference | Comment |
---|---|---|---|
371.7 | 0.10 | Weast and Grasselli, 1989 | BS |
Enthalpy of vaporization
ΔvapH (kJ/mol) | Temperature (K) | Method | Reference | Comment |
---|---|---|---|---|
43.9 | 345. | A | Stephenson and Malanowski, 1987 | Based on data from 330. to 429. K. See also Wilhoit and Zwolinski, 1973.; AC |

References

Cline and Andrews, 1931
Cline, J.K.; Andrews, D.H.,
Thermal energy studies. III. The octanols,
J. Am. Chem. Soc., 1931, 53, 3668-3673. [all data]
Kallina and Kuffner, 1960
Kallina; Kuffner,
Monatsh. Chem., 1960, 91, 289. [all data]
Dorough, Glass, et al., 1941
Dorough, G.L.; Glass, H.B.; Gresham, T.L.; Malone, G.B.; Reid, E.E.,
Structure-property relationships in some isomeric octanols,
J. Am. Chem. Soc., 1941, 63, 3100. [all data]
Gude and Teja, 1995
Gude, M.; Teja, A.S.,
Vapor-Liquid Critical Properties of Elements and Compounds. 4. Aliphatic Alkanols,
J. Chem. Eng. Data, 1995, 40, 1025-1036. [all data]
Lawrenson and Lee, 1978
Lawrenson, I.J.; Lee, D.A.,
Thermodynamic properties of organic oxygen compounds XLVIII. The critical temperature of some alkanols,
J. Chem. Thermodyn., 1978, 10, 1111. [all data]
Weast and Grasselli, 1989
CRC Handbook of Data on Organic Compounds, 2nd Editon, Weast,R.C and Grasselli, J.G., ed(s)., CRC Press, Inc., Boca Raton, FL, 1989, 1. [all data]
Stephenson and Malanowski, 1987
Stephenson, Richard M.; Malanowski, Stanislaw,
Handbook of the Thermodynamics of Organic Compounds, 1987, https://doi.org/10.1007/978-94-009-3173-2
. [all data]
Wilhoit and Zwolinski, 1973
Wilhoit, R.C.; Zwolinski, B.J.,
Physical and thermodynamic properties of aliphatic alcohols,
J. Phys. Chem. Ref. Data Suppl., 1973, 1, 2, 1. [all data]