Trichlorofluorosilane
- Formula: Cl3FSi
- Molecular weight: 153.443
- IUPAC Standard InChIKey: PGHWHQUVLXTFLZ-UHFFFAOYSA-N
- CAS Registry Number: 14965-52-7
- Chemical structure:
View 3d structure (requires JavaScript / HTML 5) - Permanent link for this species. Use this link for bookmarking this species for future reference.

Gas phase thermochemistry data

Quantity | Value | Units | Method | Reference | Comment |
---|---|---|---|---|---|
ΔfH°gas | -840.98 | kJ/mol | Review | Chase, 1998 | Data last reviewed in December, 1960 |
Quantity | Value | Units | Method | Reference | Comment |
S°gas,1 bar | 335.95 | J/mol*K | Review | Chase, 1998 | Data last reviewed in December, 1960 |
Gas Phase Heat Capacity (Shomate Equation)
Cp° = A + B*t + C*t2 + D*t3 +
E/t2
H° − H°298.15= A*t + B*t2/2 +
C*t3/3 + D*t4/4 − E/t + F − H
S° = A*ln(t) + B*t + C*t2/2 + D*t3/3 −
E/(2*t2) + G
Cp = heat capacity (J/mol*K)
H° = standard enthalpy (kJ/mol)
S° = standard entropy (J/mol*K)
t = temperature (K) / 1000.
View plot Requires a JavaScript / HTML 5 canvas capable browser.
Temperature (K) | 298. to 6000. |
---|---|
A | 104.7356 |
B | 2.809549 |
C | -0.753643 |
D | 0.063909 |
E | -1.413268 |
F | -877.0668 |
G | 453.9431 |
H | -840.9840 |
Reference | Chase, 1998 |
Comment | Data last reviewed in December, 1960 |

Reaction thermochemistry data

Data compiled by: John E. Bartmess
Individual Reactions
+
= Cl4FSi-
By formula: Cl- + Cl3FSi = Cl4FSi-
Quantity | Value | Units | Method | Reference | Comment |
---|---|---|---|---|---|
ΔrH° | 115. ± 7.1 | kJ/mol | CIDT | Hao, Kaspar, et al., 2005 | gas phase |

Ion clustering data

Data compiled by: John E. Bartmess
Clustering reactions
+
= Cl4FSi-
By formula: Cl- + Cl3FSi = Cl4FSi-
Quantity | Value | Units | Method | Reference | Comment |
---|---|---|---|---|---|
ΔrH° | 115. ± 7.1 | kJ/mol | CIDT | Hao, Kaspar, et al., 2005 | gas phase |

References

Chase, 1998
Chase, M.W., Jr.,
NIST-JANAF Themochemical Tables, Fourth Edition,
J. Phys. Chem. Ref. Data, Monograph 9, 1998, 1-1951. [all data]
Hao, Kaspar, et al., 2005
Hao, C.T.; Kaspar, J.D.; Check, C.E.; Lobring, K.C.; Gilbert, T.M.; Sunderlin, L.S.,
Effect of substituents on the strength of A-Cl- (A = Si, Ge, and Sn) bonds in hypervalent systems: ACl(5)(-), ACl(4)F(-), and A(CH3)(3)Cl-2(-),
J. Phys. Chem. A, 2005, 109, 9, 2026-2034, https://doi.org/10.1021/jp040743x
. [all data]