Hexanoic acid, 2-ethyl-
- Formula: C8H16O2
- Molecular weight: 144.2114
- IUPAC Standard InChIKey: OBETXYAYXDNJHR-UHFFFAOYSA-N
- CAS Registry Number: 149-57-5
- Chemical structure:

Gas phase thermochemistry data

Data compiled by: Hussein Y. Afeefy, Joel F. Liebman, and Stephen E. Stein
Quantity | Value | Units | Method | Reference | Comment |
---|---|---|---|---|---|
ΔfH°gas | -559.5 ± 2.1 | kJ/mol | Ccr | Stridh, 1976 |

Condensed phase thermochemistry data

Data compiled by: Hussein Y. Afeefy, Joel F. Liebman, and Stephen E. Stein
Quantity | Value | Units | Method | Reference | Comment |
---|---|---|---|---|---|
ΔfH°liquid | -635.1 ± 2.0 | kJ/mol | Ccr | Stridh, 1976 | |
Quantity | Value | Units | Method | Reference | Comment |
ΔcH°liquid | -4799.6 ± 1.7 | kJ/mol | Ccr | Stridh, 1976 | Corresponding ΔfHºliquid = -635.14 kJ/mol (simple calculation by NIST; no Washburn corrections) |

Phase change data

Data compiled as indicated in comments:
BS - Robert L. Brown and Stephen E. Stein
TRC - Thermodynamics Research Center, NIST Boulder Laboratories, Chris Muzny director
AC - William E. Acree, Jr., James S. Chickos
ALS - Hussein Y. Afeefy, Joel F. Liebman, and Stephen E. Stein
Quantity | Value | Units | Method | Reference | Comment |
---|---|---|---|---|---|
Tboil | 501.2 | K | N/A | Aldrich Chemical Company Inc., 1990 | BS |
Quantity | Value | Units | Method | Reference | Comment |
Tc | 675. | K | N/A | Steele, Chirico, et al., 1997 | Uncertainty assigned by TRC = 5. K; derived from fit of obs. vapor pressure; TRC |
Tc | 673.6 | K | N/A | Teja and Anselme, 1990 | Uncertainty assigned by TRC = 1.2 K; TRC |
Tc | 674.6 | K | N/A | Teja and Rosenthal, 1990 | Uncertainty assigned by TRC = 0.8 K; TRC |
Quantity | Value | Units | Method | Reference | Comment |
Pc | 27.80 | bar | N/A | Steele, Chirico, et al., 1997 | Uncertainty assigned by TRC = 3.00 bar; derived from fit of obs. vapor pressure; TRC |
Pc | 27.78 | bar | N/A | Teja and Rosenthal, 1990 | Uncertainty assigned by TRC = 0.40 bar; TRC |
Quantity | Value | Units | Method | Reference | Comment |
ρc | 1.803 | mol/l | N/A | Steele, Chirico, et al., 1997 | Uncertainty assigned by TRC = 0.10 mol/l; TRC |
ρc | 1.89 | mol/l | N/A | Teja and Anselme, 1990 | Uncertainty assigned by TRC = 0.04 mol/l; TRC |
Quantity | Value | Units | Method | Reference | Comment |
ΔvapH° | 76.3 ± 0.9 | kJ/mol | EB | Steele, Chirico, et al., 1997, 2 | Based on data from 397. to 514. K.; AC |
ΔvapH° | 75.60 ± 0.42 | kJ/mol | C | Stridh, 1976 | ALS |
ΔvapH° | 75.6 ± 0.5 | kJ/mol | C | Stridh, 1976 | AC |
Enthalpy of vaporization
ΔvapH (kJ/mol) | Temperature (K) | Method | Reference | Comment |
---|---|---|---|---|
61.8 | 418. | A | Stephenson and Malanowski, 1987 | Based on data from 403. to 500. K.; AC |

Kovats' RI, non-polar column, isothermal

Column type | Active phase | Temperature (C) | I | Reference | Comment |
---|---|---|---|---|---|
Capillary | DB-1 | 170. | 1085.19 | Kuhn, 2001 | 30. m/0.53 mm/3. μm, He |

Van Den Dool and Kratz RI, non-polar column, temperature ramp

Column type | Active phase | I | Reference | Comment |
---|---|---|---|---|
Capillary | HP-5MS | 1116.7 | Zeng, Zhao, et al., 2007 | 30. m/0.25 mm/0.25 μm, He, 4. K/min; Tstart: 80. C; Tend: 300. C |
Capillary | DB-5 | 1123. | Nogueira, Bittrich, et al., 2001 | 30. m/0.25 mm/0.25 μm, H2, 3. K/min; Tstart: 60. C; Tend: 240. C |
Capillary | HP-5 | 1128.0 | Siegmund, Derler, et al., 2001 | 30. m/0.25 mm/0.25 μm, He, 5.3 K/min, 280. C @ 5. min; Tstart: 35. C |
Capillary | DB-5 | 1123. | Moio L., Rillo L., et al., 1996 | 30. m/0.32 mm/1. μm, H2, 3. K/min; Tstart: 40. C; Tend: 220. C |
Packed | SE-30 | 1161. | Peng, Ding, et al., 1988 | He, Supelcoport and Chromosorb, 40. C @ 4. min, 10. K/min, 250. C @ 60. min; Column length: 3.05 m |

Van Den Dool and Kratz RI, non-polar column, custom temperature program

Column type | Active phase | I | Reference | Comment |
---|---|---|---|---|
Capillary | DB-5 | 1128. | Triqui and Reineccius, 1995 | 30. m/0.25 mm/1. μm, He; Program: 35C (2min) => 40C/min => 50C (1min) => 6C/min => 250C (10min) |

Van Den Dool and Kratz RI, polar column, temperature ramp

Column type | Active phase | I | Reference | Comment |
---|---|---|---|---|
Capillary | DB-Wax | 1962.5 | Siegmund, Derler, et al., 2001 | 30. m/0.32 mm/0.5 μm, He, 1.1 K/min, 250. C @ 10. min; Tstart: 35. C |
Capillary | DB-Wax | 1914. | Ollé, Baumes, et al., 1998 | 30. m/0.32 mm/0.5 μm, 40. C @ 3. min, 3. K/min, 245. C @ 20. min |
Capillary | DB-Wax | 1969. | Shimoda, Shigematsu, et al., 1995 | 60. m/0.25 mm/0.25 μm, 2. K/min; Tstart: 50. C; Tend: 230. C |
Capillary | DB-Wax | 1950. | Shiratsuchi, Shimoda, et al., 1994 | 60. m/0.25 mm/0.25 μm, He, 2. K/min, 230. C @ 60. min; Tstart: 50. C |

Van Den Dool and Kratz RI, polar column, custom temperature program

Column type | Active phase | I | Reference | Comment |
---|---|---|---|---|
Capillary | Supelcowax-10 | 1965. | Sing, Smadja, et al., 1992 | 60. m/0.25 mm/0.25 μm, He; Program: 20C(0.5min) => 60C => 4C/min => 250C |

Normal alkane RI, non-polar column, temperature ramp

Column type | Active phase | I | Reference | Comment |
---|---|---|---|---|
Capillary | VF-5 MS | 1124. | Leffingwell and Alford, 2011 | 60. m/0.32 mm/0.25 μm, Helium, 2. K/min, 260. C @ 28. min; Tstart: 30. C |
Capillary | VF-5 MS | 1126. | Leffingwell and Alford, 2011 | 60. m/0.32 mm/0.25 μm, Helium, 2. K/min, 260. C @ 28. min; Tstart: 30. C |
Capillary | HP-5 MS | 1140. | Jerkovic and Marijanovic, 2010 | 30. m/0.25 mm/0.25 μm, Helium, 70. C @ 2. min, 3. K/min, 200. C @ 18. min |
Capillary | HP-5 MS | 1122. | Pino, Marquez, et al., 2010 | 30. m/0.32 mm/0.25 μm, Helium, 50. C @ 2. min, 4. K/min, 240. C @ 10. min |
Capillary | HP-5 MS | 1108. | Radulovic, Dordevic, et al., 2010 | 30. m/0.25 mm/0.25 μm, Helium, 5. K/min, 290. C @ 10. min; Tstart: 70. C |
Capillary | HP-5 | 1126. | Saidana, Mahjoub, et al., 2008 | 30. m/0.25 mm/0.25 μm, Nitrogen, 50. C @ 1. min, 5. K/min, 280. C @ 1. min |
Capillary | DB-5 | 1114. | Ozel, Gogus, et al., 2006 | 30. m/0.32 mm/0.25 μm, He, 60. C @ 0.5 min, 5. K/min, 280. C @ 2. min |
Capillary | SPB-5 | 1105. | Sebastian, Viallon-Fernandez, et al., 2003 | 60. m/0.32 mm/1.0 μm, Helium, 3. K/min; Tstart: 30. C; Tend: 230. C |
Capillary | Ultra-2 | 1126. | King, Matthews, et al., 1995 | 50. m/0.32 mm/0.52 μm, He, 40. C @ 3. min, 4. K/min, 250. C @ 30. min |
Capillary | Ultra-2 | 1139. | King, Hamilton, et al., 1993 | 50. m/0.32 mm/0.52 μm, He, 40. C @ 3. min, 4. K/min, 250. C @ 30. min |
Capillary | DB-5 | 1123. | Moio, Dekimpe, et al., 1993 | 30. m/0.32 mm/1. μm, H2, 3. K/min; Tstart: 40. C; Tend: 220. C |

Normal alkane RI, non-polar column, custom temperature program

Column type | Active phase | I | Reference | Comment |
---|---|---|---|---|
Capillary | Polydimethyl siloxane with 5 % Ph groups | 1128. | Robinson, Adams, et al., 2012 | Program: not specified |
Capillary | Polydimethyl siloxane with 5 % Ph groups | 1130. | Robinson, Adams, et al., 2012 | Program: not specified |
Capillary | Siloxane, 5 % Ph | 1104. | VOC BinBase, 2012 | Program: not specified |
Capillary | Polydimethyl siloxane, 5 % phenyl | 1104. | Skogerson, Wohlgemuth, et al., 2011 | Program: not specified |
Capillary | HP-5 MS | 1122. | Pino, Marquez, et al., 2010 | 30. m/0.32 mm/0.25 μm, Helium; Program: not specified |
Capillary | DB-1 | 1097. | Delort and Jaquier, 2009 | 60. m/0.25 mm/0.25 μm, Helium; Program: 50 0C (5 min) 3 0C/min -> 120 0C 5 0C/min -> 250 0C (3 min) 15 0C/min -> 300 0C (20 min) |
Capillary | HP-5 | 1128. | Zhao, Li, et al., 2008 | 30. m/0.25 mm/0.25 μm; Program: 40 0C (2 min) 5 0C/min -> 80 0C 7 oC/min -> 160 0C 9 0C/min -> 200 0C 20 0C/min -> 280 0C (10 min) |
Capillary | SE-54 | 1126. | Um, Bailey, et al., 1992 | He; Column length: 50. m; Column diameter: 0.32 mm; Program: 35 0C (5 min) 8 0C/min -> 200 0C 2 0C/min -> 250 0C |
Capillary | OV-1 | 1117. | Waggott and Davies, 1984 | Hydrogen; Column length: 50. m; Column diameter: 0.32 mm; Program: not specified |

Normal alkane RI, polar column, temperature ramp

Column type | Active phase | I | Reference | Comment |
---|---|---|---|---|
Capillary | HP-FFAP | 1965. | Wanakhachornkrai and Lertsiri, 9999 | 25. m/0.32 mm/0.50 μm, Helium, 15. K/min; Tstart: 45. C; Tend: 220. C |
Capillary | HP-FFAP | 1968. | Wanakhachornkrai and Lertsiri, 9999 | 25. m/0.32 mm/0.50 μm, Helium, 15. K/min; Tstart: 45. C; Tend: 220. C |
Capillary | HP-FFAP | 1968. | Wanakhachornkrai and Lertsiri, 9999 | 25. m/0.32 mm/0.50 μm, Helium, 15. K/min; Tstart: 45. C; Tend: 220. C |
Capillary | CP Wax 52 CB | 1910. | Chen, Chyau, et al., 2007 | 60. m/0.25 mm/0.25 μm, Helium, 3. K/min; Tstart: 40. C; Tend: 220. C |
Capillary | RTX-Wax | 1934. | Prososki, Etzel, et al., 2007 | 30. m/0.25 mm/0.5 μm, He, 40. C @ 5. min, 10. K/min, 220. C @ 10. min |
Capillary | DB-Wax Etr | 1960. | Ibarz, Ferreira, et al., 2006 | 60. m/0.25 mm/0.25 μm, He, 40. C @ 5. min, 2. K/min, 230. C @ 100. min |
Capillary | HP-FFAP | 1968. | Wanakhachornkrai and Lertsiri, 2003 | 25. m/0.32 mm/0.5 μm, He, 15. K/min; Tstart: 45. C; Tend: 220. C |
Capillary | HP-FFAP | 1968. | Wanakhachornkrai and Lertsiri, 2003 | 25. m/0.32 mm/0.5 μm, He, 15. K/min; Tstart: 45. C; Tend: 220. C |
Capillary | HP-FFAP | 1965. | Wanakhachornkrai and Lertsiri, 2003 | 25. m/0.32 mm/0.5 μm, He, 15. K/min; Tstart: 45. C; Tend: 220. C |
Capillary | TC-Wax | 1937. | Suhardi, Suzuki, et al., 2002 | 60. m/0.25 mm/0.25 μm, He, 40. C @ 10. min, 3. K/min, 230. C @ 10. min |
Capillary | DB-Wax | 1933. | Iwatsuki, Mizota, et al., 1999 | 4. K/min; Column length: 30. m; Column diameter: 0.53 mm; Tstart: 60. C; Tend: 210. C |
Capillary | DB-Wax | 1928. | Iwatsuki, Mizota, et al., 1999 | 4. K/min; Column length: 30. m; Column diameter: 0.53 mm; Tstart: 60. C; Tend: 210. C |
Capillary | DB-Wax | 1954. | Sekiwa, Kubota, et al., 1997 | He, 2. K/min; Column length: 60. m; Column diameter: 0.25 mm; Tstart: 60. C; Tend: 180. C |
Capillary | TC-Wax | 1918. | Shuichi, Masazumi, et al., 1996 | 80. C @ 5. min, 3. K/min; Column length: 60. m; Column diameter: 0.25 mm; Tend: 240. C |

Normal alkane RI, polar column, custom temperature program

Column type | Active phase | I | Reference | Comment |
---|---|---|---|---|
Capillary | DB-Wax | 1969. | Welke, Manfroi, et al., 2012 | 30. m/0.25 mm/0.25 μm, Helium; Program: not specified |
Capillary | DB-Wax | 1974. | Welke, Manfroi, et al., 2012 | 30. m/0.25 mm/0.25 μm, Helium; Program: not specified |
Capillary | DB-Wax Etr | 1960. | Loskos, Hernandez-Orte, et al., 2007 | 60. m/0.25 mm/0.5 μm, He; Program: 40C(3min) => 10C/min => 90C => 2C/min => 230C (37min) |
Capillary | BP-20 | 1946. | Pontes, Marques, et al., 2007 | 30. m/0.25 mm/0.25 μm, He; Program: 50C(1min) => 2.5C/min => 100C => 2C/min => 180C => 15C/min => 220C |
Capillary | BP-20 | 1967. | Pontes, Marques, et al., 2007 | 30. m/0.25 mm/0.25 μm, He; Program: 50C(1min) => 2.5C/min => 100C => 2C/min => 180C => 15C/min => 220C |

Lee's RI, non-polar column, custom temperature program

Column type | Active phase | I | Reference | Comment |
---|---|---|---|---|
Capillary | DB-5MS | 180.8 | Aracil, Font, et al., 2005 | Column length: 60. m; Column diameter: 0.25 mm; Program: not specified |

References

Stridh, 1976
Stridh, G.,
Enthalpy of formation of 2-ethylhexanoic acid,
J. Chem. Thermodyn., 1976, 8, 193-194. [all data]
Aldrich Chemical Company Inc., 1990
Aldrich Chemical Company Inc.,
Catalog Handbook of Fine Chemicals, Aldrich Chemical Company, Inc., Milwaukee WI, 1990, 1. [all data]
Steele, Chirico, et al., 1997
Steele, W.V.; Chirico, R.D.; Knipmeyer, S.E.; Nguyen, A.,
Vapor Pressure, Heat Capacity, and Density along the Saturted Line, Measurements for Cyclohexanol, 2-Cyclohexen-1-one, 1,2-Dichloropropane, 1,4-Di-tert-butylbenzene, (±)-2-Ethylhexanoic Acid, 1-(m,
J. Chem. Eng. Data, 1997, 42, 1021-36. [all data]
Teja and Anselme, 1990
Teja, A.S.; Anselme, M.J.,
The critical properties of thermally stable and unstable fluids. II. 1986 results,
AIChE Symp. Ser., 1990, 86, 279, 122-7. [all data]
Teja and Rosenthal, 1990
Teja, A.S.; Rosenthal, D.J.,
The Critical Pressures and Temperatures of Twelve Substances Using A Low Residence Time Flow Apparatus,
AIChE Symp. Ser., 1990, 86, 279, 133-7. [all data]
Steele, Chirico, et al., 1997, 2
Steele, W.V.; Chirico, R.D.; Knipmeyer, S.E.; Nguyen, A.,
Vapor Pressure, Heat Capacity, and Density along the Saturation Line, Measurements for Cyclohexanol, 2-Cyclohexen-1-one, 1,2-Dichloropropane, 1,4-Di- tert -butylbenzene, (±)-2-Ethylhexanoic Acid, 2-(Methylamino)ethanol, Perfluoro- n -heptane, and Sulfolane,
J. Chem. Eng. Data, 1997, 42, 6, 1021-1036, https://doi.org/10.1021/je9701036
. [all data]
Stephenson and Malanowski, 1987
Stephenson, Richard M.; Malanowski, Stanislaw,
Handbook of the Thermodynamics of Organic Compounds, 1987, https://doi.org/10.1007/978-94-009-3173-2
. [all data]
Kuhn, 2001
Kuhn, E.R.,
Selectivity vs. polarity: the fundamentals of chromatographic separation,
J. Sep. Sci., 2001, 24, 6, 473-476, https://doi.org/10.1002/1615-9314(20010601)24:6<473::AID-JSSC473>3.0.CO;2-Y
. [all data]
Zeng, Zhao, et al., 2007
Zeng, Y.-X.; Zhao, C.-X.; Liang, Y.-Z.; Yang, H.; Fang, H.-Z.; Yi, L.-Z.; Zeng, Z.-D.,
Comparative analysis of volatile components from Clematis species growing in China,
Anal. Chim. Acta., 2007, 595, 1-2, 328-339, https://doi.org/10.1016/j.aca.2006.12.022
. [all data]
Nogueira, Bittrich, et al., 2001
Nogueira, P.C.L.; Bittrich, V.; Shepherd, G.J.; Lopes, A.V.; Marsaioli, A.J.,
The ecological and taxonomic importance of flower volatiles of Clusia species (Guttiferae),
Phytochemistry, 2001, 56, 5, 443-452, https://doi.org/10.1016/S0031-9422(00)00213-2
. [all data]
Siegmund, Derler, et al., 2001
Siegmund, B.; Derler, K.; Pfannhauser, W.,
Changes in the aroma of a strawberry drink during storage,
J. Agric. Food Chem., 2001, 49, 7, 3244-3252, https://doi.org/10.1021/jf010116u
. [all data]
Moio L., Rillo L., et al., 1996
Moio L.; Rillo L.; Ledda A.; Addeo F.,
Odorous constituents of ovine milk in relationship to diet,
J. Dairy Sci., 1996, 79, 8, 1322-1331, https://doi.org/10.3168/jds.S0022-0302(96)76488-3
. [all data]
Peng, Ding, et al., 1988
Peng, C.T.; Ding, S.F.; Hua, R.L.; Yang, Z.C.,
Prediction of Retention Indexes I. Structure-Retention Index Relationship on Apolar Columns,
J. Chromatogr., 1988, 436, 137-172, https://doi.org/10.1016/S0021-9673(00)94575-8
. [all data]
Triqui and Reineccius, 1995
Triqui, R.; Reineccius, G.A.,
Changes in flavor profiles with ripening of anchovy (Engraulis encrasicholus),
J. Agric. Food Chem., 1995, 43, 7, 1883-1889, https://doi.org/10.1021/jf00055a024
. [all data]
Ollé, Baumes, et al., 1998
Ollé, D.; Baumes, R.L.; Bayonove, C.L.; Lozano, Y.F.; Sznaper, C.; Brillouet, J.-M.,
Comparison of free and glycosidically linked volatile components from polyembryonic and monoembryonic mango (Mangifera indica L.) cultivars,
J. Agric. Food Chem., 1998, 46, 3, 1094-1100, https://doi.org/10.1021/jf9705781
. [all data]
Shimoda, Shigematsu, et al., 1995
Shimoda, M.; Shigematsu, H.; Shiratsuchi, H.; Osajima, Y.,
Comparison of the odor concentrates by SDE and adsorptive column method from green tea infusion,
J. Agric. Food Chem., 1995, 43, 6, 1616-1620, https://doi.org/10.1021/jf00054a037
. [all data]
Shiratsuchi, Shimoda, et al., 1994
Shiratsuchi, H.; Shimoda, M.; Imayoshi, K.; Noda, K.; Osajima, Y.,
Volatile flavor compounds in spray-dried skim milk powder,
J. Agric. Food Chem., 1994, 42, 4, 984-988, https://doi.org/10.1021/jf00040a028
. [all data]
Sing, Smadja, et al., 1992
Sing, A.S.C.; Smadja, J.; Brevard, H.; Maignial, L.; Chaintreau, A.; Marion, J.-P.,
Volatile constituents of faham (Jumellea fragrans (Thou.) Schltr.),
J. Agric. Food Chem., 1992, 40, 4, 642-646, https://doi.org/10.1021/jf00016a024
. [all data]
Leffingwell and Alford, 2011
Leffingwell, J.; Alford, E.D.,
Volatile constituents of the giant pufball mushroom (Calvatia gigantea),
Leffingwell Rep., 2011, 4, 1-17. [all data]
Jerkovic and Marijanovic, 2010
Jerkovic, I.; Marijanovic, Z.,
Oak (Quercus frainetto Ten.) honeydaw honey - approach to screening of volatile organic composition and antioxidant capacity (DPPH and FRAP assay),
Molecules, 2010, 15, 5, 3744-3756, https://doi.org/10.3390/molecules15053744
. [all data]
Pino, Marquez, et al., 2010
Pino, J.A.; Marquez, E.; Quijano, C.E.; Castro, D.,
Volatile compounds in noni (Morinda citrifolia L.) at two ripening stages,
Ciencia e Technologia de Alimentos, 2010, 30, 1, 183-187, https://doi.org/10.1590/S0101-20612010000100028
. [all data]
Radulovic, Dordevic, et al., 2010
Radulovic, N.; Dordevic, N.; Markovic, M.; Palic, R.,
Volatile constituents of Glechoma Hirsuta Waldst. Kit. and G. Hederacea L. (Lamiaceae),
Bull. Chem. Soc. Ethiop., 2010, 24, 1, 67-76, https://doi.org/10.4314/bcse.v24i1.52962
. [all data]
Saidana, Mahjoub, et al., 2008
Saidana, D.; Mahjoub, M.A.; Boussaada, O.; Chriaa, J.; Cheraif, I.; Daami, M.; Mighri, Z.; Helal, A.N.,
Chemical composition and antimicrobial activity of volatile compounds of Tamarix boveana (Tamaricaceae),
Microbiol. Res., 2008, 163, 4, 445-455, https://doi.org/10.1016/j.micres.2006.07.009
. [all data]
Ozel, Gogus, et al., 2006
Ozel, M.Z.; Gogus, F.; Lewis, A.C.,
Comparison of direct thermal desorption with water distillation and superheated water extraction for the analysis of volatile components of Rosa damascena Mill. using GCxGC-TOF/MS,
Anal. Chim. Acta., 2006, 566, 2, 172-177, https://doi.org/10.1016/j.aca.2006.03.014
. [all data]
Sebastian, Viallon-Fernandez, et al., 2003
Sebastian, I.; Viallon-Fernandez, C.; Berge, P.; Berdague, J.-L.,
Analysis of the volatile fraction of lamb fat tissue: influence of the type of feeding,
Sciences des Aliments, 2003, 23, 4, 497-511, https://doi.org/10.3166/sda.23.497-511
. [all data]
King, Matthews, et al., 1995
King, M.-F.; Matthews, M.A.; Rule, D.C.; Field, R.A.,
Effect of beef packaging method on volatile compounds developed by oven roasting or microwave cooking,
J. Agric. Food Chem., 1995, 43, 3, 773-778, https://doi.org/10.1021/jf00051a039
. [all data]
King, Hamilton, et al., 1993
King, M.-F.; Hamilton, B.L.; Matthews, M.A.; Rule, D.C.; Field, R.A.,
Isolation and identification of volatiles and condensable material in raw beef with supercritical carbon dioxide extraction,
J. Agric. Food Chem., 1993, 41, 11, 1974-1981, https://doi.org/10.1021/jf00035a030
. [all data]
Moio, Dekimpe, et al., 1993
Moio, L.; Dekimpe, J.; Etievant, P.; Addeo, F.,
Neutral volatile compounds in the raw milks from different species,
J. Dairy Res., 1993, 60, 2, 199-213, https://doi.org/10.1017/S0022029900027515
. [all data]
Robinson, Adams, et al., 2012
Robinson, A.L.; Adams, D.O.; Boss, P.K.; Heymann, H.; Solomon, P.S.; Trengove, R.D.,
Influence of geographic origine on the sensory characteristics and wine composition of Vitus viniferas cv. Cabernet Sauvignon wines from Australia (Supplemental data),
Am. J. Enol. Vitic., 2012, 64, 4, 467-476, https://doi.org/10.5344/ajev.2012.12023
. [all data]
VOC BinBase, 2012
VOC BinBase,
The volatile compound BinBase (VOC BinBase), 2012, retrieved from http://fiehnlab.ucdavis.edu/projects/VocBinBase and http://binbase.sourceforge.net. [all data]
Skogerson, Wohlgemuth, et al., 2011
Skogerson, K.; Wohlgemuth, G.; Fiehn, O.,
VocBinNase, 2011, retrieved from http://fiehnlab.ucdavis.edu/projects//VocBinBase. [all data]
Delort and Jaquier, 2009
Delort, E.; Jaquier, A.,
Novel terpenyl esters from Australian finger lime (Citrus australasica) peel extract,
Flav. Fragr. J., 2009, 24, 3, 123-132, https://doi.org/10.1002/ffj.1922
. [all data]
Zhao, Li, et al., 2008
Zhao, Y.; Li, J.; Xu, Y.; Duan, H.; Fan, W.; Zhao, G.,
EXtraction, preparation and identification of volatile compounds in Changyu XO brandy,
Chinese J. Chromatogr., 2008, 26, 2, 212-222, https://doi.org/10.1016/S1872-2059(08)60014-0
. [all data]
Um, Bailey, et al., 1992
Um, K.W.; Bailey, M.E.; Clarke, A.D.; Chao, R.R.,
Concentration and identification of volatile compounds from heated beef fat using supercritical CO2 extraction-gas liquid chromatography/mass spectrometry,
J. Agric. Food Chem., 1992, 40, 9, 1641-1646, https://doi.org/10.1021/jf00021a033
. [all data]
Waggott and Davies, 1984
Waggott, A.; Davies, I.W.,
Identification of organic pollutants using linear temperature programmed retention indices (LTPRIs) - Part II, 1984, retrieved from http://dwi.defra.gov.uk/research/completed-research/reports/dwi0383.pdf. [all data]
Wanakhachornkrai and Lertsiri, 9999
Wanakhachornkrai, P.; Lertsiri, S.,
Comparison of determination method for volatile compounds in Thai soy sauce,
Analytical, Nutritional and Clinical Methods, 9999, 1-11. [all data]
Chen, Chyau, et al., 2007
Chen, C.-C.; Chyau, C.-C.; Hseu, TY.-H.,
Production of a COX-2 inhibitor, 2,4,5-trimethoxybenzaldehyde, with submerged cultured Antrodia camphorata,
Lett. Appl. Microbiol., 2007, 44, 4, 387-392, https://doi.org/10.1111/j.1472-765X.2006.02087.x
. [all data]
Prososki, Etzel, et al., 2007
Prososki, R.A.; Etzel, M.R.; Rankin, S.A.,
Solvent type affects the number, distribution, and relative quantities of volatile compounds found in sweet whey powder,
J. Dairy Sci., 2007, 90, 2, 523-531, https://doi.org/10.3168/jds.S0022-0302(07)71535-7
. [all data]
Ibarz, Ferreira, et al., 2006
Ibarz, M.J.; Ferreira, V.; Hernández-Orte, P.; Loscos, N.; Cacho, J.,
Optimization and evaluation of a procedure for the gas chromatographic-mass spectrometric analysis of the aromas generated by fast acid hydrolysis of flavor precursors extracted from grapes,
J. Chromatogr. A, 2006, 1116, 1-2, 217-229, https://doi.org/10.1016/j.chroma.2006.03.020
. [all data]
Wanakhachornkrai and Lertsiri, 2003
Wanakhachornkrai, P.; Lertsiri, S.,
Analytical, nutritional, and clinical methods. Comparison of determination method for volatile compounds in Thai soy sauce,
Food Chem., 2003, 83, 4, 619-629, https://doi.org/10.1016/S0308-8146(03)00256-5
. [all data]
Suhardi, Suzuki, et al., 2002
Suhardi, S.; Suzuki, M.; Yoshida, K.; Muto, T.; Fujita, A.; Watanbe, N.,
Changes in the volatile compounds and in the chemical and physical properties of snake fruit (Salacca edulis Reinw) Cv. Pondoh during maturation,
J. Agric. Food Chem., 2002, 50, 26, 7627-7633, https://doi.org/10.1021/jf020620e
. [all data]
Iwatsuki, Mizota, et al., 1999
Iwatsuki, K.; Mizota, Y.; Kubota, T.; Nishimura, O.; Masuda, H.; Sotoyama, K.; Tomita, M.,
Aroma extract dilution analysis. Evluation of aroma of pasteurized and UHT processed milk by aroma extract dilution analysis,
Nippon Shokuhin Kagaku Kogaku Kaishi, 1999, 46, 9, 587-597, https://doi.org/10.3136/nskkk.46.587
. [all data]
Sekiwa, Kubota, et al., 1997
Sekiwa, Y.; Kubota, K.; Kobayashi, A.,
Characteristic flavor components in the brew of cooked clam (Meretrix lusoria) and the effect of storage on flavor formation,
J. Agric. Food Chem., 1997, 45, 3, 826-830, https://doi.org/10.1021/jf960433e
. [all data]
Shuichi, Masazumi, et al., 1996
Shuichi, H.; Masazumi, N.; Hiromu, K.; Kiyoshi, F.,
Comparison of volatile compounds berween the crude drugs, Onji-tsutsu and Onji-niki,
Nippon nogei kagaku kaishi, 1996, 70, 2, 151-160. [all data]
Welke, Manfroi, et al., 2012
Welke, J.E.; Manfroi, V.; Zanus, M.; Lazarotto, M.; Zini, C.A.,
Characterization of the volatile profile of Brazilian merlot wines through comprehensive two dimensional gas chromatography time-of-flight mass spectrometric detection,
J. Chromatogr. A, 2012, 1226, 124-139, https://doi.org/10.1016/j.chroma.2012.01.002
. [all data]
Loskos, Hernandez-Orte, et al., 2007
Loskos, N.; Hernandez-Orte, P.; Cacho, J.; Ferreira, V.,
Release and formation of varietal aroma compounds during alcoholic fermentation from nonfloral grape odorless flavor precursors fractions,
J. Agric. Food Chem., 2007, 55, 16, 6674-6684, https://doi.org/10.1021/jf0702343
. [all data]
Pontes, Marques, et al., 2007
Pontes, M.; Marques, J.C.; Camara, J.S.,
Screening of volatile composition from Portuguese multifloral honeys using headspace solid-phase microextraction-gas chromatography-quadrupole mass spectrometry,
Talanta, 2007, 74, 1, 91-103, https://doi.org/10.1016/j.talanta.2007.05.037
. [all data]
Aracil, Font, et al., 2005
Aracil, I.; Font, R.; Conesa, J.A.,
Semivolatile and volatile compounds from the pyrolysis and combustion of polyvinyl chloride,
J. Anal. Appl. Pyrolysis, 2005, 74, 1-2, 465-478, https://doi.org/10.1016/j.jaap.2004.09.008
. [all data]