1-Methyl-1,2,3,4-tetrahydronaphthalen-1-ol
- Formula: C11H14O
- Molecular weight: 162.2283
- IUPAC Standard InChIKey: HAQPAIYNBOCMTO-UHFFFAOYSA-N
- CAS Registry Number: 14944-28-6
- Chemical structure:
View 3d structure (requires JavaScript / HTML 5) - Other names: 1-Methyl-1,2,3,4-tetrahydro-1-naphthalenol; 1-Methyl-1,2,3,4,-tetrahydro-1-naphthol

Condensed phase thermochemistry data

Data compiled by: Hussein Y. Afeefy, Joel F. Liebman, and Stephen E. Stein
Quantity | Value | Units | Method | Reference | Comment |
---|---|---|---|---|---|
ΔcH°solid | -6085.2 | kJ/mol | Ccb | Hock and Knauel, 1951 | Corresponding ΔfHºsolid = -244. kJ/mol (simple calculation by NIST; no Washburn corrections) |

References

Hock and Knauel, 1951
Hock, I.H.; Knauel, G.,
Autoxydation von kohlenwasserstoffen, XIV. Mitteil. Uber die energetische stellung organischer hydroperoxyde,
Chem. Ber., 1951, 84, 1-5. [all data]