trifluoromethanesulphonic acid

Reaction thermochemistry data

Data compiled by: John E. Bartmess

Individual Reactions

CF3O3S- + Hydrogen cation = CHF3O3S

By formula: CF3O3S- + H+ = CHF3O3S

Quantity Value Units Method Reference Comment
Δr1278. ± 9.2kJ/molG+TSKoppel, Taft, et al., 1994gas phase; Per Leito, Raamat, et al., 2009, dGacid is likely too weak by at least 1.3 kcal/mol, and possibly 5.3, due to problems in the ladder at dGacid=299
Δr<1312. ± 8.4kJ/molEIAEAdams, Smith, et al., 1986gas phase; From CF3SO3H,anhydride
Quantity Value Units Method Reference Comment
Δr1253. ± 8.4kJ/molIMREKoppel, Taft, et al., 1994gas phase; Per Leito, Raamat, et al., 2009, dGacid is likely too weak by at least 1.3 kcal/mol, and possibly 5.3, due to problems in the ladder at dGacid=299
Δr1250. ± 10.kJ/molIMRBViggiano, Henchman, et al., 1992gas phase

References

Koppel, Taft, et al., 1994
Koppel, I.A.; Taft, R.W.; Anvia, F.; Zhu, S.Z.; Hu, L.Q.; Sung, K.S.; Desmarteau, D.D.; Yagupolskii, L.M., The Gas-Phase Acidities of Very Strong Neutral Bronsted Acids, J. Am. Chem. Soc., 1994, 116, 7, 3047, https://doi.org/10.1021/ja00086a038 . [all data]

Leito, Raamat, et al., 2009
Leito, I.; Raamat, E.; Kutt, A.; Saame, J.; Kipper, K.; Koppel, I.A.; Koppel, I.; Zhang, M.; Mishima, M.; Yagupolskii, L.M.; Garlyauskayte, R.Y.; Filatov, A.A., Revision of the Gas-Phase Acidity Scale below 300 kcal mol(-1), J. Phys. Chem. A, 2009, 113, 29, 8421-8424, https://doi.org/10.1021/jp903780k . [all data]

Adams, Smith, et al., 1986
Adams, N.G.; Smith, D.; Viggiano, A.A.; Paulson, J.F.; Henchman, M.J., Dissociative attachment reactions of electron with strong acid molecules, J. Chem. Phys., 1986, 84, 6728. [all data]

Viggiano, Henchman, et al., 1992
Viggiano, A.A.; Henchman, M.J.; Dale, F.; Deakyne, C.A.; Paulson, J.F., Gas-Phase Reactions of Weak Bronsted Bases I-, PO3-, HSO4-, FSO3-, and CF3SO3- with Strong Bronsted Acids H2SO4, FSO3H, and CF3SO3H - A Quantitative Study, J. Am. Chem. Soc., 1992, 114, 11, 4299, https://doi.org/10.1021/ja00037a039 . [all data]