Difluoroiodomethane
- Formula: CHF2I
- Molecular weight: 177.9199
- IUPAC Standard InChIKey: YSLFMGDEEXOKHF-UHFFFAOYSA-N
- CAS Registry Number: 1493-03-4
- Chemical structure:
View 3d structure (requires JavaScript / HTML 5) - Other names: Methane, difluoroiodo-

Phase change data

Data compiled by: William E. Acree, Jr., James S. Chickos
Enthalpy of vaporization
ΔvapH (kJ/mol) | Temperature (K) | Method | Reference | Comment |
---|---|---|---|---|
26.0 | 272. | A | Stephenson and Malanowski, 1987 | Based on data from 227. to 287. K. See also Kudchadker, Kudchadker, et al., 1979 and Dykyj, 1970. |

References

Stephenson and Malanowski, 1987
Stephenson, Richard M.; Malanowski, Stanislaw,
Handbook of the Thermodynamics of Organic Compounds, 1987, https://doi.org/10.1007/978-94-009-3173-2
. [all data]
Kudchadker, Kudchadker, et al., 1979
Kudchadker, A.P.; Kudchadker, S.A.; Shukla, R.P.; Patnaik, P.R.,
Vapor pressures and boiling points of selected halomethanes,
J. Phys. Chem. Ref. Data, 1979, 8, 2, 499, https://doi.org/10.1063/1.555600
. [all data]
Dykyj, 1970
Dykyj, J.,
Petrochemica, 1970, 10, 2, 51. [all data]