Butanoic acid, 2-amino-, (S)-
- Formula: C4H9NO2
- Molecular weight: 103.1198
- IUPAC Standard InChIKey: QWCKQJZIFLGMSD-GSVOUGTGSA-N
- CAS Registry Number: 1492-24-6
- Chemical structure:
View 3d structure (requires JavaScript / HTML 5) - Species with the same structure:
- Stereoisomers:
- Other names: Butyric acid, 2-amino-, L-; L-α-Amino-n-butyric acid; L-α-Aminobutyrate; L-α-Aminobutyric acid; L-Butyrine; L-2-Aminobutyric acid; L-2-Aminobutanoic acid; (-)-2-aminobutyric acid; S 2-aminobutyric acid

Phase change data

Data compiled by: William E. Acree, Jr., James S. Chickos
Enthalpy of sublimation
ΔsubH (kJ/mol) | Temperature (K) | Method | Reference | Comment |
---|---|---|---|---|
162.5 | 455. | A | Stephenson and Malanowski, 1987 | Based on data from 449. to 462. K. |
162.8 ± 0.8 | 455. | ME | Svec and Clyde, 1965 | See also Clyde and Svec, 1964. |

References

Stephenson and Malanowski, 1987
Stephenson, Richard M.; Malanowski, Stanislaw,
Handbook of the Thermodynamics of Organic Compounds, 1987, https://doi.org/10.1007/978-94-009-3173-2
. [all data]
Svec and Clyde, 1965
Svec, H.J.; Clyde, D.D.,
Vapor Pressures of Some α-Amino Acids.,
J. Chem. Eng. Data, 1965, 10, 2, 151-152, https://doi.org/10.1021/je60025a024
. [all data]
Clyde and Svec, 1964
Clyde, D.D.; Svec, H.,
, U. S. Atomic Energy Comm. IS-790, 1964, 1. [all data]