5-Hexynenitrile
- Formula: C6H7N
- Molecular weight: 93.1265
- IUPAC Standard InChIKey: JZYKFLLRVPPISG-UHFFFAOYSA-N
- CAS Registry Number: 14918-21-9
- Chemical structure:
View 3d structure (requires JavaScript / HTML 5) - Other names: 5-Cyano-1-pentyne; 5-cyanopent-1-yne

Phase change data

Data compiled by: Robert L. Brown and Stephen E. Stein
Reduced pressure boiling point
Tboil (K) | Pressure (bar) | Reference |
---|---|---|
388. to 390. | 0.149 | Farchan Laboratories, 1990 |

References

Farchan Laboratories, 1990
Farchan Laboratories,
Research Chemicals Catalog, Farchan Laboratories, Gainesville, FL, 1990, 91. [all data]