3-Octyn-1-ol
- Formula: C8H14O
- Molecular weight: 126.1962
- IUPAC Standard InChIKey: LRZGRGVRZSDRTK-UHFFFAOYSA-N
- CAS Registry Number: 14916-80-4
- Chemical structure:
View 3d structure (requires JavaScript / HTML 5) - Other names: oct-3-yn-1-ol

Phase change data

Data compiled by: Robert L. Brown and Stephen E. Stein
Reduced pressure boiling point
Tboil (K) | Pressure (bar) | Reference |
---|---|---|
379. | 0.12 | Farchan Laboratories, 1990 |

References

Farchan Laboratories, 1990
Farchan Laboratories,
Research Chemicals Catalog, Farchan Laboratories, Gainesville, FL, 1990, 91. [all data]