t-Butyldimethylvinylethynylperoxide
- Formula: C11H18O2
- Molecular weight: 182.2594
- IUPAC Standard InChIKey: NRZBWVAKKOCBFV-UHFFFAOYSA-N
- CAS Registry Number: 14906-32-2
- Chemical structure:
View 3d structure (requires JavaScript / HTML 5) - Species with the same structure:

Condensed phase thermochemistry data

Data compiled by: Hussein Y. Afeefy, Joel F. Liebman, and Stephen E. Stein
Quantity | Value | Units | Method | Reference | Comment |
---|---|---|---|---|---|
ΔfH°liquid | -28.9 ± 3.5 | kJ/mol | Ccb | Van-Chin-Syan, Dolbneva, et al., 1982 | see 81DOL/VAS |
Quantity | Value | Units | Method | Reference | Comment |
ΔcH°liquid | -6872.2 ± 3.5 | kJ/mol | Ccb | Van-Chin-Syan, Dolbneva, et al., 1982 | see 81DOL/VAS; Corresponding ΔfHºliquid = -28.9 kJ/mol (simple calculation by NIST; no Washburn corrections) |

Gas phase thermochemistry data

Data compiled by: Hussein Y. Afeefy, Joel F. Liebman, and Stephen E. Stein
Quantity | Value | Units | Method | Reference | Comment |
---|---|---|---|---|---|
ΔfH°gas | 22.7 ± 3.5 | kJ/mol | Ccb | Van-Chin-Syan, Dolbneva, et al., 1982 | see 81DOL/VAS |

Phase change data

Data compiled as indicated in comments:
ALS - Hussein Y. Afeefy, Joel F. Liebman, and Stephen E. Stein
DRB - Donald R. Burgess, Jr.
Quantity | Value | Units | Method | Reference | Comment |
---|---|---|---|---|---|
ΔvapH° | 12.3 ± 0.05 | kcal/mol | V | Van-Chin-Syan, Dolbneva, et al., 1982 | see 81DOL/VAS; ALS |
ΔvapH° | 12.3 | kcal/mol | N/A | Van-Chin-Syan, Dolbneva, et al., 1982 | DRB |

References

Van-Chin-Syan, Dolbneva, et al., 1982
Van-Chin-Syan, Yu.Ya.; Dolbneva, T.N.; Vasil'ev, V.P.; Chuchmarev, S.K.; Puchin, V.A.,
Thermodynamic Properties of Dimethyl-vinylethynylmethanol and its derivatives,
Russ. J. Phys. Chem. (Engl. Transl.), 1982, 56, 1736-1767. [all data]