Benzeneethanol, α-methyl-
- Formula: C9H12O
- Molecular weight: 136.1910
- IUPAC Standard InChIKey: WYTRYIUQUDTGSX-UHFFFAOYSA-N
- CAS Registry Number: 14898-87-4
- Chemical structure:
View 3d structure (requires JavaScript / HTML 5) - Species with the same structure:
- Other names: α-Methylphenethyl alcohol; Benzyl methyl carbinol; Phenethyl alcohol, α-methyl-; 1-Phenyl-2-propanol; 2-Hydroxy-1-phenylpropane; 2-Propanol, 1-phenyl-; α-Methylbenzeneethanol; Benzenethanol, α-methyl-; NSC 53553; 1-phenylpropan-2-ol

Phase change data

Data compiled by: Robert L. Brown and Stephen E. Stein
Reduced pressure boiling point
Tboil (K) | Pressure (bar) | Reference |
---|---|---|
378. to 381. | 0.020 | Frinton Laboratories Inc., 1986 |

References

Frinton Laboratories Inc., 1986
Frinton Laboratories Inc.,
Catalog Number 11, Frinton Laboratories Inc., Vineland, NJ, 1986, 99. [all data]