2-Butanol, (R)-
- Formula: C4H10O
- Molecular weight: 74.1216
- IUPAC Standard InChIKey: BTANRVKWQNVYAZ-BYPYZUCNSA-N
- CAS Registry Number: 14898-79-4
- Chemical structure:
View 3d structure (requires JavaScript / HTML 5) - Stereoisomers:
- Other names: sec-Butyl Alcohol, (R)-(-)-; (-)-2-Butanol; (R)-(-)-2-Butanol; (R)-2-Butanol; (R)-butan-2-ol

Phase change data

Data compiled as indicated in comments:
BS - Robert L. Brown and Stephen E. Stein
TRC - Thermodynamics Research Center, NIST Boulder Laboratories, Chris Muzny director
Quantity | Value | Units | Method | Reference | Comment |
---|---|---|---|---|---|
Tboil | 372.7 | K | N/A | Weast and Grasselli, 1989 | BS |
Tboil | 372.45 | K | N/A | Burwell, 1937 | Uncertainty assigned by TRC = 0.5 K; TRC |

References

Weast and Grasselli, 1989
CRC Handbook of Data on Organic Compounds, 2nd Editon, Weast,R.C and Grasselli, J.G., ed(s)., CRC Press, Inc., Boca Raton, FL, 1989, 1. [all data]
Burwell, 1937
Burwell, R.L.,
J. Am. Chem. Soc., 1937, 59, 1609. [all data]