Cyclopropanecarboxaldehyde
- Formula: C4H6O
- Molecular weight: 70.0898
- IUPAC Standard InChIKey: JMYVMOUINOAAPA-UHFFFAOYSA-N
- CAS Registry Number: 1489-69-6
- Chemical structure:
View 3d structure (requires JavaScript / HTML 5) - Other names: Cyclopropylcarboxaldehyde

Reaction thermochemistry data

Data compiled by: John E. Bartmess
Individual Reactions
C4H5O- + =
By formula: C4H5O- + H+ = C4H6O
Quantity | Value | Units | Method | Reference | Comment |
---|---|---|---|---|---|
ΔrH° | 1631. ± 21. | kJ/mol | G+TS | Baschky, Peterson, et al., 1994 | gas phase; Between D2O and PhF. Cis and Trans anions do not interconvert and have same expt. acidity. |
Quantity | Value | Units | Method | Reference | Comment |
ΔrG° | 1598. ± 21. | kJ/mol | IMRB | Baschky, Peterson, et al., 1994 | gas phase; Between D2O and PhF. Cis and Trans anions do not interconvert and have same expt. acidity. |
C4H5O- + =
By formula: C4H5O- + H+ = C4H6O
Quantity | Value | Units | Method | Reference | Comment |
---|---|---|---|---|---|
ΔrH° | 1572. ± 8.8 | kJ/mol | G+TS | Chou, Dahlke, et al., 1993 | gas phase; barrier for opening to CH2=C(CHO)CH2-: 29 kcal/mol. |
Quantity | Value | Units | Method | Reference | Comment |
ΔrG° | 1543. ± 8.4 | kJ/mol | IMRE | Chou, Dahlke, et al., 1993 | gas phase; barrier for opening to CH2=C(CHO)CH2-: 29 kcal/mol. |

Gas phase ion energetics data

Data compiled by: John E. Bartmess
De-protonation reactions
C4H5O- + =
By formula: C4H5O- + H+ = C4H6O
Quantity | Value | Units | Method | Reference | Comment |
---|---|---|---|---|---|
ΔrH° | 1631. ± 21. | kJ/mol | G+TS | Baschky, Peterson, et al., 1994 | gas phase; Between D2O and PhF. Cis and Trans anions do not interconvert and have same expt. acidity. |
Quantity | Value | Units | Method | Reference | Comment |
ΔrG° | 1598. ± 21. | kJ/mol | IMRB | Baschky, Peterson, et al., 1994 | gas phase; Between D2O and PhF. Cis and Trans anions do not interconvert and have same expt. acidity. |
C4H5O- + =
By formula: C4H5O- + H+ = C4H6O
Quantity | Value | Units | Method | Reference | Comment |
---|---|---|---|---|---|
ΔrH° | 1572. ± 8.8 | kJ/mol | G+TS | Chou, Dahlke, et al., 1993 | gas phase; barrier for opening to CH2=C(CHO)CH2-: 29 kcal/mol. |
Quantity | Value | Units | Method | Reference | Comment |
ΔrG° | 1543. ± 8.4 | kJ/mol | IMRE | Chou, Dahlke, et al., 1993 | gas phase; barrier for opening to CH2=C(CHO)CH2-: 29 kcal/mol. |

Normal alkane RI, non-polar column, custom temperature program

Column type | Active phase | I | Reference | Comment |
---|---|---|---|---|
Capillary | Methyl Silicone | 617. | Zenkevich, 1996 | Program: not specified |

References

Baschky, Peterson, et al., 1994
Baschky, M.C.; Peterson, K.C.; Kass, S.R.,
Stereospecificity in the gas phase. Formation and characterization of configurationally stable cyclopropyl anions,
J. Am. Chem. Soc., 1994, 116, 16, 7218, https://doi.org/10.1021/ja00095a026
. [all data]
Chou, Dahlke, et al., 1993
Chou, P.K.; Dahlke, G.D.; Kass, S.R.,
Unimolecular Rearrangements of Carbanions in the Gas Phase .2. Cyclopropyl Anions,
J. Chem. Soc. Chem. Comm., 1993, 115, 1, 315, https://doi.org/10.1021/ja00054a045
. [all data]
Zenkevich, 1996
Zenkevich, I.G.,
Informational Maitenance of Gas Chromatographic Identification of Organic Compounds in Ecoanalytical Investigations,
Z. Anal. Chem., 1996, 51, 11, 1140-1148. [all data]