1,3-Cyclohexadiene, 1-methyl-
- Formula: C7H10
- Molecular weight: 94.1543
- IUPAC Standard InChIKey: QMFJIJFIHIDENY-UHFFFAOYSA-N
- CAS Registry Number: 1489-56-1
- Chemical structure:
View 3d structure (requires JavaScript / HTML 5) - Other names: 1-Methyl-1,3-cyclohexadiene; 2,3-dihydrotoluene

Kovats' RI, non-polar column, isothermal

Column type | Active phase | Temperature (C) | I | Reference | Comment |
---|---|---|---|---|---|
Capillary | SE-30 | 80. | 771. | Bredael, 1982 | Column length: 100. m; Column diameter: 0.5 mm |

Normal alkane RI, non-polar column, custom temperature program

Column type | Active phase | I | Reference | Comment |
---|---|---|---|---|
Packed | SE-30 | 791. | Buchman, Cao, et al., 1984 | He, Chromosorb AW; Column length: 3.05 m; Program: not specified |
Capillary | OV-1, SE-30, Methyl silicone, SP-2100, OV-101, DB-1, etc. | 771. | Waggott and Davies, 1984 | Hydrogen; Column length: 50. m; Column diameter: 0.32 mm; Program: not specified |

Reaction thermochemistry data

Data compiled by: Hussein Y. Afeefy, Joel F. Liebman, and Stephen E. Stein

Individual Reactions

1,3-Cyclohexadiene, 5-methyl- = 1,3-Cyclohexadiene, 1-methyl-

By formula: C7H10 = C7H10

Quantity Value Units Method Reference Comment
Δr10. ± 3.kJ/molKinDoering, Roth, et al., 1991gas phase; At 603 K

1,3-Cyclohexadiene, 1-methyl- = 1,3-Cyclohexadiene, 3-methyl

By formula: C7H10 = C7H10

Quantity Value Units Method Reference Comment
Δr3. ± 4.6kJ/molKinDoering, Roth, et al., 1991gas phase; At 603 K

References

Bredael, 1982
Bredael, P.,
Retention indices of hydrocarbons on SE-30,
J. Hi. Res. Chromatogr. Chromatogr. Comm., 1982, 5, 6, 325-328, https://doi.org/10.1002/jhrc.1240050610
. [all data]
Buchman, Cao, et al., 1984
Buchman, O.; Cao, G.-Y.; Peng, C.T.,
Structure assignment by retention index in gas-liquid radiochromatography of substituted cyclohexenes,
J. Chromatogr., 1984, 312, 75-90, https://doi.org/10.1016/S0021-9673(01)92765-7
. [all data]
Waggott and Davies, 1984
Waggott, A.; Davies, I.W.,
Identification of organic pollutants using linear temperature programmed retention indices (LTPRIs) - Part II, 1984, retrieved from http://dwi.defra.gov.uk/research/completed-research/reports/dwi0383.pdf. [all data]