Thiabendazole
- Formula: C10H7N3S
- Molecular weight: 201.248
- IUPAC Standard InChIKey: WJCNZQLZVWNLKY-UHFFFAOYSA-N
- CAS Registry Number: 148-79-8
- Chemical structure:
View 3d structure (requires JavaScript / HTML 5) - Other names: 1H-Benzimidazole, 2-(4-thiazolyl)-; Benzimidazole, 2-(4-thiazolyl)-; Equizole; Mertec; Mertect; Mertect 160; Metasol TK 100; Mintesol; Mintezol; Minzolum; MK 360; Omnizole; Tebuzate; Tecto; Tecto 10P; Tecto 40F; Tecto 60; Testo; Thiabendazol; Thiabenzole; Thibenzol; Thibenzole; Thibenzole 200; Tiabenda; Triasox; TBZ; TBZ 6; TBZ 60W; 2-(Thiazol-4-yl)benzimidazole; 2-(4-Thiazolyl)benzimidazole; 2-(4'-Thiazolyl)benzimidazole; Apl-Luster; Bovizole; E-Z-Ex; Eprofil; Lombristop; Mycozol; Nemapan; Polival; Thiaben; Thibenzole ATT; Top form wormer; 2-Thiazole-4-ylbenzimidazole; Arbotect; 4-(2-Benzimidazolyl)thiazole; Bioguard; RPH; Storite; Tbdz; Tecto rph; Thiabenzazole; 2-(4-Thiazolyl)-1H-benzimidazole; Tobaz; Tiabendazole; Equivet TZ; Tiabendazol; Tibimix 20; Thibendole; Thiabendole; Sistesan; Sanaizol 100; Chemviron TK 100; Tecto B; 5-(4-Thiazolyl)benzimidazole; Ormogal; Cropasal; Drawipas; g 491; Hokustar HP; Mertect 340F; Mertect LSP; 2-(1,3-Thiazol-4-yl)benzimidazole; Hymush; Nemacin; Thiprazole; Tubazole; 2-(4-Thiazolyl)-1H-benzoimidazole; 4-(1H-Benzimidazol-2-yl)thiazole; Pitrizet; Metasol TK 25; Statin; 2-(4-Thiazolyl)-1H-benzimidazole (thiabendazole)

Phase change data

Data compiled as indicated in comments:
TRC - Thermodynamics Research Center, NIST Boulder Laboratories, Chris Muzny director
AC - William E. Acree, Jr., James S. Chickos
Quantity | Value | Units | Method | Reference | Comment |
---|---|---|---|---|---|
Tfus | 574.8 | K | N/A | Plato, 1972 | Uncertainty assigned by TRC = 0.2 K; TRC |
Enthalpy of fusion
ΔfusH (kJ/mol) | Temperature (K) | Method | Reference | Comment |
---|---|---|---|---|
35.2 | 573.2 | DSC | Muela, Escalera, et al., 2010 | AC |

Kovats' RI, non-polar column, isothermal

Column type | Active phase | Temperature (C) | I | Reference | Comment |
---|---|---|---|---|---|
Capillary | OV-1 | 220. | 2088. | Erdmann, Rochholz, et al., 1992 |

Kovats' RI, non-polar column, custom temperature program

Column type | Active phase | I | Reference | Comment |
---|---|---|---|---|
Packed | OV-101 | 2080. | McLinden and Stenhouse, 1979 | N2, Chromosorb W; Column length: 2. m; Program: not specified |

Van Den Dool and Kratz RI, non-polar column, temperature ramp

Column type | Active phase | I | Reference | Comment |
---|---|---|---|---|
Packed | SE-30 | 2010. | Perrigo and Peel, 1981 | N2, Chromosorb W, 130. C @ 2. min, 8. K/min, 290. C @ 8. min; Column length: 1.8 m |

Normal alkane RI, non-polar column, custom temperature program

Column type | Active phase | I | Reference | Comment |
---|---|---|---|---|
Capillary | 5 % Phenyl methyl siloxane | 2091. | Department of Food Safety and Welfare, 2006 | 30. m/0.25 mm/0.25 μm, Helium; Program: 50 0C(1 min) 25 0C/min -> 125 0C 10 0C/min -> 300 0C (10 min) |
Other | Methyl Silicone | 2040. | Ardrey and Moffat, 1981 | Program: not specified |

References

Plato, 1972
Plato, C.,
DSC as a general method for determining purity and heat of fusion of high-purity organic chemicals,
Anal. Chem., 1972, 44, 1531. [all data]
Muela, Escalera, et al., 2010
Muela, Susana; Escalera, Begoña; Peña, M. Ángeles; Bustamante, Pilar,
Influence of temperature on the solubilization of thiabendazole by combined action of solid dispersions and co-solvents,
International Journal of Pharmaceutics, 2010, 384, 1-2, 93-99, https://doi.org/10.1016/j.ijpharm.2009.10.001
. [all data]
Erdmann, Rochholz, et al., 1992
Erdmann, F.; Rochholz, G.; Schütz, H.,
Retention-indices on OV-1 of approximately 170 commonly used pesticides,
Mikrochim. Acta, 1992, 106, 3-6, 219-226, https://doi.org/10.1007/BF01242093
. [all data]
McLinden and Stenhouse, 1979
McLinden, V.J.; Stenhouse, A.M.,
A chromatography system for drug identification,
Forensic Sci. Int., 1979, 13, 71-79, https://doi.org/10.1016/0379-0738(79)90265-2
. [all data]
Perrigo and Peel, 1981
Perrigo, B.J.; Peel, H.W.,
The use of retention indices and temperature-programmed gas chromatography in analytical toxicology,
J. Chromatogr. Sci., 1981, 19, 5, 219-226, https://doi.org/10.1093/chromsci/19.5.219
. [all data]
Department of Food Safety and Welfare, 2006
Department of Food Safety, Ministry of Health; Welfare,
Analytical methods for residual compositional substances of agricultural chemicals, feed aadditives, and veterinary drugs in foods, 2006, retrieved from http://www.mhlw.go.jp/english/topics/foodsafety/positivelist060228/de/060526-1a.pdf. [all data]
Ardrey and Moffat, 1981
Ardrey, R.E.; Moffat, A.C.,
Gas-liquid chromatographic retention indices of 1318 substances of toxicological interest on SE-30 or OV-1 stationary phase,
J. Chromatogr., 1981, 220, 3, 195-252, https://doi.org/10.1016/S0021-9673(00)81925-1
. [all data]