Furan, 2,3-dihydro-5-methyl-
- Formula: C5H8O
- Molecular weight: 84.1164
- IUPAC Standard InChIKey: BGCWDXXJMUHZHE-UHFFFAOYSA-N
- CAS Registry Number: 1487-15-6
- Chemical structure:
View 3d structure (requires JavaScript / HTML 5) - Other names: 2-Methyl-4,5-dihydrofuran; 2,3-Dihydro-5-methylfuran; 4,5-Dihydro-2-methylfuran; 5-Methyl-2,3-dihydrofuran; 4,5-Dihydrosylvan

Gas phase thermochemistry data

Data compiled by: Hussein Y. Afeefy, Joel F. Liebman, and Stephen E. Stein
Quantity | Value | Units | Method | Reference | Comment |
---|---|---|---|---|---|
ΔfH°gas | -122.6 | kJ/mol | Eqk | Cocks and Egger, 1973 | |
ΔfH°gas | -130.2 ± 3.5 | kJ/mol | Ccb | Pihlaja and Heikkila, 1969 |

Condensed phase thermochemistry data

Data compiled by: Hussein Y. Afeefy, Joel F. Liebman, and Stephen E. Stein
Quantity | Value | Units | Method | Reference | Comment |
---|---|---|---|---|---|
ΔfH°liquid | -165.0 ± 2.3 | kJ/mol | Ccb | Pihlaja and Heikkila, 1969 | |
Quantity | Value | Units | Method | Reference | Comment |
ΔcH°liquid | -2945.9 ± 2.3 | kJ/mol | Ccb | Pihlaja and Heikkila, 1969 | Corresponding ΔfHºliquid = -165.0 kJ/mol (simple calculation by NIST; no Washburn corrections) |

Phase change data

Data compiled as indicated in comments:
BS - Robert L. Brown and Stephen E. Stein
TRC - Thermodynamics Research Center, NIST Boulder Laboratories, Chris Muzny director
ALS - Hussein Y. Afeefy, Joel F. Liebman, and Stephen E. Stein
DRB - Donald R. Burgess, Jr.
Quantity | Value | Units | Method | Reference | Comment |
---|---|---|---|---|---|
Tboil | 355.2 | K | N/A | Aldrich Chemical Company Inc., 1990 | BS |
Tboil | 354.65 | K | N/A | Paul and Tchelitcheff, 1950 | Uncertainty assigned by TRC = 1.5 K; TRC |
Quantity | Value | Units | Method | Reference | Comment |
ΔvapH° | 35. ± 1. | kJ/mol | V | Pihlaja and Heikkila, 1969 | ALS |
ΔvapH° | 34.8 | kJ/mol | N/A | Pihlaja and Heikkila, 1969 | DRB |

Reaction thermochemistry data

Data compiled by: Hussein Y. Afeefy, Joel F. Liebman, and Stephen E. Stein
Individual Reactions
By formula: C5H8O = C5H8O
Quantity | Value | Units | Method | Reference | Comment |
---|---|---|---|---|---|
ΔrH° | -4.7 ± 0.3 | kJ/mol | Eqk | Taskinen, 1994 | liquid phase; solvent: Dipentyl ether |
By formula: C5H8O = C5H8O
Quantity | Value | Units | Method | Reference | Comment |
---|---|---|---|---|---|
ΔrH° | -9.6 ± 3.3 | kJ/mol | Eqk | Cocks and Egger, 1973 | gas phase |

Gas phase ion energetics data

Data evaluated by: Edward P. Hunter and Sharon G. Lias
Quantity | Value | Units | Method | Reference | Comment |
---|---|---|---|---|---|
Proton affinity (review) | 910.3 | kJ/mol | N/A | Hunter and Lias, 1998 | |
Quantity | Value | Units | Method | Reference | Comment |
Gas basicity | 877.9 | kJ/mol | N/A | Hunter and Lias, 1998 |

Kovats' RI, non-polar column, isothermal

Column type | Active phase | Temperature (C) | I | Reference | Comment |
---|---|---|---|---|---|
Packed | Apiezon L | 120. | 662. | Bogoslovsky, Anvaer, et al., 1978 | Celite 545 |
Packed | Apiezon L | 160. | 677. | Bogoslovsky, Anvaer, et al., 1978 | Celite 545 |

Normal alkane RI, non-polar column, custom temperature program

Column type | Active phase | I | Reference | Comment |
---|---|---|---|---|
Capillary | Methyl Silicone | 640. | Zenkevich, 1999 | Program: not specified |
Capillary | Polydimethyl siloxanes | 640. | Zenkevich, 1997 | Program: not specified |

References

Cocks and Egger, 1973
Cocks, A.T.; Egger, K.W.,
Gas-phase thermal unimolecular isomerizations of acetylcyclopropane. Part I. The equilibrium between 2,3-dihydro-5-methylfuran and acetylcyclopropane,
J. Chem. Soc. Perkin Trans. 2, 1973, 197-199. [all data]
Pihlaja and Heikkila, 1969
Pihlaja, K.; Heikkila, J.,
Heats of formation of cyclic vinyl ethers,
Suom. Kemistil. B, 1969, 42, 338-342. [all data]
Aldrich Chemical Company Inc., 1990
Aldrich Chemical Company Inc.,
Catalog Handbook of Fine Chemicals, Aldrich Chemical Company, Inc., Milwaukee WI, 1990, 1. [all data]
Paul and Tchelitcheff, 1950
Paul, R.; Tchelitcheff, S.,
The Methylenyl-2-tetrahydrofuran. Application to the Preparation of beta-Ethylenic Alcohols. Synthesis of Sylvanne,
Bull. Soc. Chim. Fr., 1950, 1950, 520. [all data]
Taskinen, 1994
Taskinen, E.,
Relative thermodynamic stabilities of γ-methylene-γ-butyrolactone and α-angelicalactone,
Tetrahedron, 1994, 50, 1885-1888. [all data]
Hunter and Lias, 1998
Hunter, E.P.; Lias, S.G.,
Evaluated Gas Phase Basicities and Proton Affinities of Molecules: An Update,
J. Phys. Chem. Ref. Data, 1998, 27, 3, 413-656, https://doi.org/10.1063/1.556018
. [all data]
Bogoslovsky, Anvaer, et al., 1978
Bogoslovsky, Yu.N.; Anvaer, B.I.; Vigdergauz, M.S.,
Chromatographic constants in gas chromatography (in Russian), Standards Publ. House, Moscow, 1978, 192. [all data]
Zenkevich, 1999
Zenkevich, I.G.,
New Application of the Retention Index Concept in Gas and High Performance Liquid Chromatography,
Fresenius' J. Anal. Chem., 1999, 365, 4, 305-309, https://doi.org/10.1007/s002160051491
. [all data]
Zenkevich, 1997
Zenkevich, I.G.,
Influence of the Variations of Dynamics Molecular Parameterts on the Additivity of Chromatigraphic Retention Indices of Products of Organic Reactions Relative to Initial Reagents,
Dokl. Akad. Nauk (Rus.), 1997, 353, 5, 625-627. [all data]