CD2
- Formula: CD2
- Molecular weight: 16.0389
- IUPAC Standard InChIKey: HZVOZRGWRWCICA-DICFDUPASA-N
- CAS Registry Number: 14863-68-4
- Chemical structure:
View 3d structure (requires JavaScript / HTML 5) - Isotopologues:

Gas phase ion energetics data

Data compiled by: John E. Bartmess
Electron affinity determinations
EA (eV) | Method | Reference | Comment |
---|---|---|---|
0.6450 ± 0.0060 | LPES | Leopold, Murray, et al., 1985 | |
1.043 ± 0.010 | LPES | Engelking, Corderman, et al., 1981 |

References

Leopold, Murray, et al., 1985
Leopold, D.G.; Murray, K.K.; Miller, A.E.S.; Lineberger, W.C.,
Methylene: A study of the X3B1 and the 1A1 states by photoelectron spectroscopy of CH2- and CD2-,
J. Chem. Phys., 1985, 83, 4849. [all data]
Engelking, Corderman, et al., 1981
Engelking, P.E.; Corderman, R.R.; Wenddoski, J.J.; Ellison, G.B.; O'Niel, V.S.; Lineberger, W.C.,
Laser photoelectron spectroscopy of CH2-, and the singlet-triplet splitting in methylene,
J. Chem. Phys., 1981, 74, 5460. [all data]