Benzaldehyde, 2-hydroxy-3-methoxy-
- Formula: C8H8O3
- Molecular weight: 152.1473
- IUPAC Standard InChIKey: JJVNINGBHGBWJH-UHFFFAOYSA-N
- CAS Registry Number: 148-53-8
- Chemical structure:
View 3d structure (requires JavaScript / HTML 5) - Other names: m-Anisaldehyde, 2-hydroxy-; o-Vanillin; 2-Hydroxy-3-methoxybenzaldehyde; 3-Methoxy-2-hydroxybenzaldehyde; 3-Methoxysalicylaldehyde; 6-Formyl-2-methoxyphenol; 6-Formylguaiacol; o-Vanilline; Oxy-2 methoxy-3 benzaldehyde; 2-Hydroxy-m-anisaldehyde; Orthovanilline; Ortho vanillin; 2-Vanillin; NSC 2150; Vanillin

Phase change data

Data compiled as indicated in comments:
BS - Robert L. Brown and Stephen E. Stein
AC - William E. Acree, Jr., James S. Chickos
Quantity | Value | Units | Method | Reference | Comment |
---|---|---|---|---|---|
Tboil | 538.7 | K | N/A | Weast and Grasselli, 1989 | BS |
Reduced pressure boiling point
Tboil (K) | Pressure (bar) | Reference | Comment |
---|---|---|---|
401.2 | 0.013 | Weast and Grasselli, 1989 | BS |
Enthalpy of sublimation
ΔsubH (kJ/mol) | Temperature (K) | Method | Reference | Comment |
---|---|---|---|---|
54.1 | 292.5 | A | Stephenson and Malanowski, 1987 | Based on data from 282. to 303. K.; AC |

Van Den Dool and Kratz RI, non-polar column, custom temperature program

Column type | Active phase | I | Reference | Comment |
---|---|---|---|---|
Capillary | VF-5MS | 1330.5 | Tret'yakov, 2008 | 30. m/0.25 mm/0.25 μm, He; Program: Multi-step temperature program; T(initial)=60C; T(final)=270C |

Normal alkane RI, non-polar column, temperature ramp

Column type | Active phase | I | Reference | Comment |
---|---|---|---|---|
Capillary | HP-5 MS | 1367. | Xu, Han, et al., 2012 | 30. m/0.25 mm/0.25 μm, 60. C @ 2. min, 15. K/min, 300. C @ 10. min |
Capillary | HP-5 MS | 1367. | Xu, Han, et al., 2009 | 30. m/0.25 mm/0.25 μm, Helium, 60. C @ 2. min, 15. K/min, 300. C @ 10. min |

References

Weast and Grasselli, 1989
CRC Handbook of Data on Organic Compounds, 2nd Editon, Weast,R.C and Grasselli, J.G., ed(s)., CRC Press, Inc., Boca Raton, FL, 1989, 1. [all data]
Stephenson and Malanowski, 1987
Stephenson, Richard M.; Malanowski, Stanislaw,
Handbook of the Thermodynamics of Organic Compounds, 1987, https://doi.org/10.1007/978-94-009-3173-2
. [all data]
Lang (editor), 1967
Lang (editor), L.,
Absorption Spectra in the Ultraviolet and Visible Region, 1967, 9, 87. [all data]
Tret'yakov, 2008
Tret'yakov, K.V.,
Retention Data. NIST Mass Spectrometry Data Center., NIST Mass Spectrometry Data Center, 2008. [all data]
Xu, Han, et al., 2012
Xu, L.-L.; Han, T.; Wu, J.-Z.; Zhang, Q.-Y.; Zhang, H.; Huang, B.-K.; Rahman, K.,
Comparative research of chemical constituents, antifungal and antitumor properties of ether extracts of Panax ginseng and its endophytic fungus, 2012, retrieved from http://www.thefreelibrary.com/Comparative .... [all data]
Xu, Han, et al., 2009
Xu, L.-L.; Han, T.; Wu, J.-Z.; Zhang, Q.-Y.; Zhang, H.; Huang, B.-K.; Rahman, K.,
Comparative research of chemical constituents, antifungal and antitumor properties of ether extracts of Panax ginseng and its endophytic fungus,
Phytomedicine: Int. J. Phytotherapy Phytopharmacology, 2009, 16, 6-7, 609-616, https://doi.org/10.1016/j.phymed.2009.03.014
. [all data]