Trifluorosilyl radical
- Formula: F3Si
- Molecular weight: 85.0807
- IUPAC Standard InChIKey: ATVLVRVBCRICNU-UHFFFAOYSA-N
- CAS Registry Number: 14835-14-4
- Chemical structure:
View 3d structure (requires JavaScript / HTML 5) - Permanent link for this species. Use this link for bookmarking this species for future reference.

Gas phase thermochemistry data

Quantity | Value | Units | Method | Reference | Comment |
---|---|---|---|---|---|
ΔfH°gas | -1085.33 | kJ/mol | Review | Chase, 1998 | Data last reviewed in December, 1977 |
Quantity | Value | Units | Method | Reference | Comment |
S°gas,1 bar | 282.37 | J/mol*K | Review | Chase, 1998 | Data last reviewed in December, 1977 |
Gas Phase Heat Capacity (Shomate Equation)
Cp° = A + B*t + C*t2 + D*t3 +
E/t2
H° − H°298.15= A*t + B*t2/2 +
C*t3/3 + D*t4/4 − E/t + F − H
S° = A*ln(t) + B*t + C*t2/2 + D*t3/3 −
E/(2*t2) + G
Cp = heat capacity (J/mol*K)
H° = standard enthalpy (kJ/mol)
S° = standard entropy (J/mol*K)
t = temperature (K) / 1000.
View plot Requires a JavaScript / HTML 5 canvas capable browser.
Temperature (K) | 298. to 1100. | 1100. to 6000. |
---|---|---|
A | 42.39647 | 82.72312 |
B | 97.32779 | 0.250286 |
C | -88.85937 | -0.054788 |
D | 28.86240 | 0.004184 |
E | -0.415787 | -3.587279 |
F | -1102.965 | -1120.312 |
G | 306.0182 | 366.7268 |
H | -1085.330 | -1085.330 |
Reference | Chase, 1998 | Chase, 1998 |
Comment | Data last reviewed in December, 1977 | Data last reviewed in December, 1977 |

References

Chase, 1998
Chase, M.W., Jr.,
NIST-JANAF Themochemical Tables, Fourth Edition,
J. Phys. Chem. Ref. Data, Monograph 9, 1998, 1-1951. [all data]