Diselenide, bis(phenylmethyl)
- Formula: C14H14Se2
- Molecular weight: 340.18
- IUPAC Standard InChIKey: HYAVEDMFTNAZQE-UHFFFAOYSA-N
- CAS Registry Number: 1482-82-2
- Chemical structure:
View 3d structure (requires JavaScript / HTML 5) - Other names: Benzyl diselenide; Dibenzyl diselenide; Dibenzyldiselenium

Gas phase thermochemistry data

Data compiled by: Hussein Y. Afeefy, Joel F. Liebman, and Stephen E. Stein
Quantity | Value | Units | Method | Reference | Comment |
---|---|---|---|---|---|
ΔfH°gas | 301. ± 4.2 | kJ/mol | Ccb | Arshadi and Shabrang, 1973 |

Condensed phase thermochemistry data

Data compiled by: Hussein Y. Afeefy, Joel F. Liebman, and Stephen E. Stein
Quantity | Value | Units | Method | Reference | Comment |
---|---|---|---|---|---|
ΔfH°solid | 171. ± 3. | kJ/mol | Ccb | Arshadi and Shabrang, 1973 | |
Quantity | Value | Units | Method | Reference | Comment |
ΔcH°solid | -8128. ± 3. | kJ/mol | Ccb | Arshadi and Shabrang, 1973 |

Phase change data

Data compiled as indicated in comments:
AC - William E. Acree, Jr., James S. Chickos
ALS - Hussein Y. Afeefy, Joel F. Liebman, and Stephen E. Stein
Enthalpy of sublimation
ΔsubH (kJ/mol) | Temperature (K) | Method | Reference | Comment |
---|---|---|---|---|
130.5 | 291. to 330. | ME | Arshadi, 1974 | See also Arshadi and Shabrang, 1973, 2.; AC |
131. ± 0.8 | 327. | V | Arshadi and Shabrang, 1973 | ALS |

References

Arshadi and Shabrang, 1973
Arshadi, M.R.; Shabrang, M.,
Heats of combustion and formation of 4-phenyl-1,2,3-selenadiazole and dibenzyl diselenide,
J. Chem. Soc. Perkin Trans. 2, 1973, 1732-1734. [all data]
Arshadi, 1974
Arshadi, Mohammed R.,
Determination of heats of sublimation of organic compounds by a mass spectrometric--knudsen effusion method,
J. Chem. Soc., Faraday Trans. 1, 1974, 70, 0, 1569, https://doi.org/10.1039/f19747001569
. [all data]
Arshadi and Shabrang, 1973, 2
Arshadi, M.R.; Shabrang, M.,
J. Chem. Soc. Perkins II, 1973, 1732. [all data]