8-Hydroxyquinoline
- Formula: C9H7NO
- Molecular weight: 145.1580
- IUPAC Standard InChIKey: MCJGNVYPOGVAJF-UHFFFAOYSA-N
- CAS Registry Number: 148-24-3
- Chemical structure:
View 3d structure (requires JavaScript / HTML 5) - Other names: Oxyquinoline; 8-Quinolinol; Bioquin; Oxin; Oxine; Oxychinolin; Phenopyridine; Quinophenol; Tumex; 1-Azanaphthalene-8-ol; 8-Hydroxychinolin; 8-Oxyquinoline; 8-OQ; 8-Quinol; Hydroxybenzopyridine; Oxybenzopyridine; Oxychinoline; 8-Oxyquinolin; Fennosan H 30; NCI-C55298; USAF EK-794; 8-Chinolinol; Fennosan; o-Oxychinolin; 8-Quinolol; Oxoquinoline; Quinolin-8-ol; NSC 2039; NSC 615011; NSC 82404

Gas phase thermochemistry data

Data compiled by: Hussein Y. Afeefy, Joel F. Liebman, and Stephen E. Stein
Quantity | Value | Units | Method | Reference | Comment |
---|---|---|---|---|---|
ΔfH°gas | 1.6 ± 0.41 | kcal/mol | Ccb | Ribeiro Da Silva, Monte, et al., 1989 | Author was aware that data differs from previously reported values |
ΔfH°gas | 6.60 ± 0.62 | kcal/mol | Ccr | Sakiyama, Nakano, et al., 1975 |

Condensed phase thermochemistry data

Data compiled by: Hussein Y. Afeefy, Joel F. Liebman, and Stephen E. Stein
Quantity | Value | Units | Method | Reference | Comment |
---|---|---|---|---|---|
ΔfH°solid | -19.8 ± 0.36 | kcal/mol | Ccb | Ribeiro Da Silva, Monte, et al., 1989 | Author was aware that data differs from previously reported values |
ΔfH°solid | -19.4 ± 0.48 | kcal/mol | Ccr | Sakiyama, Nakano, et al., 1975 | |
Quantity | Value | Units | Method | Reference | Comment |
ΔcH°solid | -1065.7 ± 0.2 | kcal/mol | Ccb | Ribeiro Da Silva, Monte, et al., 1989 | Author was aware that data differs from previously reported values |
ΔcH°solid | -1066.15 ± 0.38 | kcal/mol | Ccr | Sakiyama, Nakano, et al., 1975 | |
ΔcH°solid | -1067.8 | kcal/mol | Ccb | Wood and Jones, 1963 | |
ΔcH°solid | -1064.9 ± 0.2 | kcal/mol | Ccb | Sullivan and Hunt, 1949 | |
ΔcH°solid | -1065.3 ± 2.0 | kcal/mol | Ccb | Sullivan, Kibler, et al., 1948 |

Phase change data

Data compiled as indicated in comments:
BS - Robert L. Brown and Stephen E. Stein
TRC - Thermodynamics Research Center, NIST Boulder Laboratories, Chris Muzny director
ALS - Hussein Y. Afeefy, Joel F. Liebman, and Stephen E. Stein
AC - William E. Acree, Jr., James S. Chickos
Quantity | Value | Units | Method | Reference | Comment |
---|---|---|---|---|---|
Tfus | 347.65 | K | N/A | Manske, Ledingham, et al., 1949 | Uncertainty assigned by TRC = 2. K; TRC |
Quantity | Value | Units | Method | Reference | Comment |
ΔsubH° | 23. ± 4. | kcal/mol | AVG | N/A | Average of 6 values; Individual data points |
Reduced pressure boiling point
Tboil (K) | Pressure (atm) | Reference | Comment |
---|---|---|---|
540.2 | 0.989 | Aldrich Chemical Company Inc., 1990 | BS |
Enthalpy of sublimation
ΔsubH (kcal/mol) | Temperature (K) | Method | Reference | Comment |
---|---|---|---|---|
26.00 ± 0.41 | 308. to 328. | ME | Horton and Wendlandt, 1963 | See also Cox and Pilcher, 1970 and Stephenson and Malanowski, 1987.; AC |
Enthalpy of fusion
ΔfusH (kcal/mol) | Temperature (K) | Method | Reference | Comment |
---|---|---|---|---|
9.63 | 345.7 | AC | WANG, TAN, et al., 2008 | AC |
5.28 | 346.8 | N/A | Zorel, Costalonga, et al., 2001 | AC |

Van Den Dool and Kratz RI, non-polar column, temperature ramp

View large format table.

Column type Active phase I Reference Comment
CapillaryOV-1011326.3Ferchichi and Messadi, 19944. K/min; Column length: 25. m; Column diameter: 0.2 mm; Tstart: 30. C; Tend: 250. C
CapillaryOV-1011348.9Ferchichi and Messadi, 19944. K/min; Column length: 25. m; Column diameter: 0.2 mm; Tstart: 30. C; Tend: 250. C
CapillaryDB-51358.Rostad and Pereira, 198630. m/0.26 mm/0.25 μm, He, 50. C @ 4. min, 6. K/min, 300. C @ 20. min

Normal alkane RI, non-polar column, temperature ramp

View large format table.

Column type Active phase I Reference Comment
CapillaryUltra-11339.Du, Clery, et al., 200850. m/0.20 mm/0.33 μm, Helium, 2. K/min, 280. C @ 20. min; Tstart: 50. C
CapillaryHP-51362.Du, Clery, et al., 200850. m/0.20 mm/0.33 μm, Helium, 10. K/min, 280. C @ 8.5 min; Tstart: 50. C
CapillaryUltra-11312.Okumura, 199125. m/0.32 mm/0.25 μm, He, 3. K/min; Tstart: 80. C; Tend: 260. C

Normal alkane RI, polar column, temperature ramp

View large format table.

Column type Active phase I Reference Comment
CapillaryHP-Innowax2153.Du, Clery, et al., 200850. m/0.20 mm/0.33 μm, Helium, 10. K/min, 250. C @ 6. min; Tstart: 50. C

Lee's RI, non-polar column, temperature ramp

View large format table.

Column type Active phase I Reference Comment
CapillaryDB-5232.24Rostad and Pereira, 198630. m/0.26 mm/0.25 μm, He, 50. C @ 4. min, 6. K/min, 300. C @ 20. min

References

Ribeiro Da Silva, Monte, et al., 1989
Ribeiro Da Silva, M.A.V.; Monte, M.J.S.; Matos, M.A.R.,
Enthalpies of combustion, vapour pressures, and enthalpies of sublimation of 8-hydroxyquinoline, 5-nitro-8-hydroxyquinoline, and 2-methyl-8-hydroxyquinoline,
J. Chem. Thermodyn., 1989, 21, 159-166. [all data]
Sakiyama, Nakano, et al., 1975
Sakiyama, M.; Nakano, T.; Seki, S.,
Enthalpies of combustion of organic compounds. I. 8-Quinolinol.,
Bull. Chem. Soc. Jpn., 1975, 48, 1705-1708. [all data]
Wood and Jones, 1963
Wood, J.L.; Jones, M.M.,
Heats of formation and coordinate bond energies of some nickel(II) chelates,
J. Phys. Chem., 1963, 67, 1049-1051. [all data]
Sullivan and Hunt, 1949
Sullivan, M.V.; Hunt, H.,
Heats of combustion. IV. The heats of combustion of five aromatic amines,
J. Phys. Chem., 1949, 53, 497-500. [all data]
Sullivan, Kibler, et al., 1948
Sullivan, M.V.; Kibler, G.M.; Hunt, H.,
Heats of combustion of nitrogen containing compounds, Rpt. Tech. Memo. PUR-3 for USN Project SQUID Contract N6ori-104, Task Order No. 1 Designation No. NR 22 042 by Purdue University, Lafayette, IN, 1948, 1-46. [all data]
Manske, Ledingham, et al., 1949
Manske, R.H.F.; Ledingham, A.E.; Ashford, W.R.,
The preparation of quinolins by a modified Skraup reaction.,
Can. J. Res., 1949, 27F, 359. [all data]
Aldrich Chemical Company Inc., 1990
Aldrich Chemical Company Inc.,
Catalog Handbook of Fine Chemicals, Aldrich Chemical Company, Inc., Milwaukee WI, 1990, 1. [all data]
Horton and Wendlandt, 1963
Horton, G.R.; Wendlandt, W.W.,
The heats of dissociation of the 8-quinolinol and substituted 8-quinolinol metal chelates of uranium (VI), thorium (IV) and scandium (III),
J. Inorg. Nucl. Chem., 1963, 25, 241-245. [all data]
Cox and Pilcher, 1970
Cox, J.D.; Pilcher, G.,
Thermochemistry of Organic and Organometallic Compounds, Academic Press Inc., London, 1970, 643. [all data]
Stephenson and Malanowski, 1987
Stephenson, Richard M.; Malanowski, Stanislaw,
Handbook of the Thermodynamics of Organic Compounds, 1987, https://doi.org/10.1007/978-94-009-3173-2
. [all data]
WANG, TAN, et al., 2008
WANG, Shao-Xu; TAN, Zhi-Cheng; LI, Yan-Sheng; TONG, Bo; LI, Ying; SHI, Quan; ZHANG, Jing-Nan,
Thermodynamic Study of 8-Hydroxyquinoline by Adiabatic Calorimetry and Thermal Analysis,
Chin. J. Chem., 2008, 26, 11, 2016-2020, https://doi.org/10.1002/cjoc.200890360
. [all data]
Zorel, Costalonga, et al., 2001
Zorel, H.E., Jr.; Costalonga, A.G.C.; Crespi, M.S.; Ribiero, C.A.,
Quim. Nova, 2001, 24, 5, 599. [all data]