Quartz (SiO2)
- Formula: O2Si
- Molecular weight: 60.0843
- IUPAC Standard InChIKey: VYPSYNLAJGMNEJ-UHFFFAOYSA-N
- CAS Registry Number: 14808-60-7
- Chemical structure:
View 3d structure (requires JavaScript / HTML 5) - Species with the same structure:
- Other names: alpha-quartz; Silicon oxide

Condensed phase thermochemistry data

Quantity | Value | Units | Method | Reference | Comment |
---|---|---|---|---|---|
ΔfH°solid | -910.86 | kJ/mol | Review | Chase, 1998 | quartz phase; Data last reviewed in June, 1967 |
Solid Phase Heat Capacity (Shomate Equation)
Cp° = A + B*t + C*t2 + D*t3 +
E/t2
H° − H°298.15= A*t + B*t2/2 +
C*t3/3 + D*t4/4 − E/t + F − H
S° = A*ln(t) + B*t + C*t2/2 + D*t3/3 −
E/(2*t2) + G
Cp = heat capacity (J/mol*K)
H° = standard enthalpy (kJ/mol)
S° = standard entropy (J/mol*K)
t = temperature (K) / 1000.
View plot Requires a JavaScript / HTML 5 canvas capable browser.
Temperature (K) | 298. to 847. | 847. to 1996. |
---|---|---|
A | -6.076591 | 58.75340 |
B | 251.6755 | 10.27925 |
C | -324.7964 | -0.131384 |
D | 168.5604 | 0.025210 |
E | 0.002548 | 0.025601 |
F | -917.6893 | -929.3292 |
G | -27.96962 | 105.8092 |
H | -910.8568 | -910.8568 |
Reference | Chase, 1998 | Chase, 1998 |
Comment | quartz phase; Data last reviewed in June, 1967 | quartz phase; Data last reviewed in June, 1967 |

References

Chase, 1998
Chase, M.W., Jr.,
NIST-JANAF Themochemical Tables, Fourth Edition,
J. Phys. Chem. Ref. Data, Monograph 9, 1998, 1-1951. [all data]