NH4+
- Formula: H4N+
- Molecular weight: 18.0379
- IUPAC Standard InChIKey: QGZKDVFQNNGYKY-UHFFFAOYSA-O
- CAS Registry Number: 14798-03-9
- Chemical structure:
View 3d structure (requires JavaScript / HTML 5) - Permanent link for this species. Use this link for bookmarking this species for future reference.
- Reaction thermochemistry data: reactions 1 to 50
- Ion clustering data
- Vibrational and/or electronic energy levels

Reaction thermochemistry data

Data compiled by: Michael M. Meot-Ner (Mautner) and Sharon G. Lias
Reactions 51 to 93
By formula: (H4N+ • 7H3N • C2H3N) + H3N = (H4N+ • 8H3N • C2H3N)
Bond type: Hydrogen bond (positive ion to hydride)
Quantity | Value | Units | Method | Reference | Comment |
---|---|---|---|---|---|
ΔrH° | 25. | kJ/mol | MKER | Tzeng, Wei, et al., 1991 | gas phase; from graph |
By formula: (H4N+ • 8H3N • C2H3N) + H3N = (H4N+ • 9H3N • C2H3N)
Bond type: Hydrogen bond (positive ion to hydride)
Quantity | Value | Units | Method | Reference | Comment |
---|---|---|---|---|---|
ΔrH° | 23. | kJ/mol | MKER | Tzeng, Wei, et al., 1991 | gas phase; from graph |
By formula: (H4N+ • H3N • C2H3N) + H3N = (H4N+ • 2H3N • C2H3N)
Bond type: Hydrogen bond (positive ion to hydride)
Quantity | Value | Units | Method | Reference | Comment |
---|---|---|---|---|---|
ΔrH° | 64.9 | kJ/mol | MKER | Tzeng, Wei, et al., 1991 | gas phase; from graph |
By formula: (H4N+ • 2C4H10O2) + C4H10O2 = (H4N+ • 3C4H10O2)
Quantity | Value | Units | Method | Reference | Comment |
---|---|---|---|---|---|
ΔrH° | 60. ± 10. | kJ/mol | PHPMS | Meot-Ner (Mautner), Sieck, et al., 1996 | gas phase |
Quantity | Value | Units | Method | Reference | Comment |
ΔrS° | 114. | J/mol*K | PHPMS | Meot-Ner (Mautner), Sieck, et al., 1996 | gas phase |
By formula: (H4N+ • H3N) + CHN = (H4N+ • CHN • H3N)
Quantity | Value | Units | Method | Reference | Comment |
---|---|---|---|---|---|
ΔrH° | 59.4 | kJ/mol | PHPMS | Deakyne, Knuth, et al., 1994 | gas phase |
Quantity | Value | Units | Method | Reference | Comment |
ΔrS° | 77.4 | J/mol*K | PHPMS | Deakyne, Knuth, et al., 1994 | gas phase |
By formula: (H4N+ • C4H10O2) + C4H10O2 = (H4N+ • 2C4H10O2)
Quantity | Value | Units | Method | Reference | Comment |
---|---|---|---|---|---|
ΔrH° | 97.1 | kJ/mol | PHPMS | Meot-Ner (Mautner), Sieck, et al., 1996 | gas phase |
Quantity | Value | Units | Method | Reference | Comment |
ΔrS° | 140. | J/mol*K | PHPMS | Meot-Ner (Mautner), Sieck, et al., 1996 | gas phase |
By formula: (H4N+ • 2C3H6O) + C3H6O = (H4N+ • 3C3H6O)
Quantity | Value | Units | Method | Reference | Comment |
---|---|---|---|---|---|
ΔrH° | 66.1 | kJ/mol | PHPMS | Meot-Ner (Mautner), Sieck, et al., 1996 | gas phase |
Quantity | Value | Units | Method | Reference | Comment |
ΔrS° | 109. | J/mol*K | PHPMS | Meot-Ner (Mautner), Sieck, et al., 1996 | gas phase |
By formula: (H4N+ • 2C6H6) + C6H6 = (H4N+ • 3C6H6)
Quantity | Value | Units | Method | Reference | Comment |
---|---|---|---|---|---|
ΔrH° | 59.4 | kJ/mol | PHPMS | Liebman, Romm, et al., 1991 | gas phase |
Quantity | Value | Units | Method | Reference | Comment |
ΔrS° | 138. | J/mol*K | PHPMS | Liebman, Romm, et al., 1991 | gas phase |
By formula: (H4N+ • 2C2H3N) + C2H3N = (H4N+ • 3C2H3N)
Quantity | Value | Units | Method | Reference | Comment |
---|---|---|---|---|---|
ΔrH° | 59.4 | kJ/mol | PHPMS | Liebman, Romm, et al., 1991 | gas phase |
Quantity | Value | Units | Method | Reference | Comment |
ΔrS° | 81.6 | J/mol*K | PHPMS | Liebman, Romm, et al., 1991 | gas phase |
By formula: (H4N+ • 3C3H6O) + C3H6O = (H4N+ • 4C3H6O)
Quantity | Value | Units | Method | Reference | Comment |
---|---|---|---|---|---|
ΔrH° | 54.8 | kJ/mol | PHPMS | Meot-Ner (Mautner), Sieck, et al., 1996 | gas phase |
Quantity | Value | Units | Method | Reference | Comment |
ΔrS° | 102. | J/mol*K | PHPMS | Meot-Ner (Mautner), Sieck, et al., 1996 | gas phase |
By formula: (H4N+ • 3C2H3N) + C2H3N = (H4N+ • 4C2H3N)
Quantity | Value | Units | Method | Reference | Comment |
---|---|---|---|---|---|
ΔrH° | 49.0 | kJ/mol | PHPMS | Liebman, Romm, et al., 1991 | gas phase |
Quantity | Value | Units | Method | Reference | Comment |
ΔrS° | 92.9 | J/mol*K | PHPMS | Liebman, Romm, et al., 1991 | gas phase |
By formula: (H4N+ • C3H6O) + C3H6O = (H4N+ • 2C3H6O)
Quantity | Value | Units | Method | Reference | Comment |
---|---|---|---|---|---|
ΔrH° | 84.9 | kJ/mol | PHPMS | Meot-Ner (Mautner), Sieck, et al., 1996 | gas phase |
Quantity | Value | Units | Method | Reference | Comment |
ΔrS° | 104. | J/mol*K | PHPMS | Meot-Ner (Mautner), Sieck, et al., 1996 | gas phase |
By formula: (H4N+ • C6H6) + C6H6 = (H4N+ • 2C6H6)
Quantity | Value | Units | Method | Reference | Comment |
---|---|---|---|---|---|
ΔrH° | 71.1 | kJ/mol | PHPMS | Liebman, Romm, et al., 1991 | gas phase |
Quantity | Value | Units | Method | Reference | Comment |
ΔrS° | 128. | J/mol*K | PHPMS | Liebman, Romm, et al., 1991 | gas phase |
By formula: (H4N+ • C2H3N) + C2H3N = (H4N+ • 2C2H3N)
Quantity | Value | Units | Method | Reference | Comment |
---|---|---|---|---|---|
ΔrH° | 88.7 | kJ/mol | PHPMS | Liebman, Romm, et al., 1991 | gas phase |
Quantity | Value | Units | Method | Reference | Comment |
ΔrS° | 106. | J/mol*K | PHPMS | Liebman, Romm, et al., 1991 | gas phase |
By formula: (H4N+ • 2CHN) + CHN = (H4N+ • 3CHN)
Quantity | Value | Units | Method | Reference | Comment |
---|---|---|---|---|---|
ΔrH° | 57.3 | kJ/mol | PHPMS | Deakyne, Knuth, et al., 1994 | gas phase |
Quantity | Value | Units | Method | Reference | Comment |
ΔrS° | 90.0 | J/mol*K | PHPMS | Deakyne, Knuth, et al., 1994 | gas phase |
By formula: (H4N+ • 3CHN) + CHN = (H4N+ • 4CHN)
Quantity | Value | Units | Method | Reference | Comment |
---|---|---|---|---|---|
ΔrH° | 46.0 | kJ/mol | PHPMS | Deakyne, Knuth, et al., 1994 | gas phase |
Quantity | Value | Units | Method | Reference | Comment |
ΔrS° | 87.4 | J/mol*K | PHPMS | Deakyne, Knuth, et al., 1994 | gas phase |
By formula: (H4N+ • 10H3N) + H3N = (H4N+ • 11H3N)
Bond type: Hydrogen bond (positive ion to hydride)
Quantity | Value | Units | Method | Reference | Comment |
---|---|---|---|---|---|
ΔrH° | 20. | kJ/mol | MKER | Wei, Tzeng, et al., 1990 | gas phase; from graph |
By formula: (H4N+ • 11H3N) + H3N = (H4N+ • 12H3N)
Bond type: Hydrogen bond (positive ion to hydride)
Quantity | Value | Units | Method | Reference | Comment |
---|---|---|---|---|---|
ΔrH° | 20. | kJ/mol | MKER | Wei, Tzeng, et al., 1990 | gas phase; from graph |
By formula: (H4N+ • 12H3N) + H3N = (H4N+ • 13H3N)
Bond type: Hydrogen bond (positive ion to hydride)
Quantity | Value | Units | Method | Reference | Comment |
---|---|---|---|---|---|
ΔrH° | 20. | kJ/mol | MKER | Wei, Tzeng, et al., 1990 | gas phase; from graph |
By formula: (H4N+ • 13H3N) + H3N = (H4N+ • 14H3N)
Bond type: Hydrogen bond (positive ion to hydride)
Quantity | Value | Units | Method | Reference | Comment |
---|---|---|---|---|---|
ΔrH° | 20. | kJ/mol | MKER | Wei, Tzeng, et al., 1990 | gas phase; from graph |
By formula: (H4N+ • 14H3N) + H3N = (H4N+ • 15H3N)
Bond type: Hydrogen bond (positive ion to hydride)
Quantity | Value | Units | Method | Reference | Comment |
---|---|---|---|---|---|
ΔrH° | 20. | kJ/mol | MKER | Wei, Tzeng, et al., 1990 | gas phase; from graph |
By formula: (H4N+ • 15H3N) + H3N = (H4N+ • 16H3N)
Bond type: Hydrogen bond (positive ion to hydride)
Quantity | Value | Units | Method | Reference | Comment |
---|---|---|---|---|---|
ΔrH° | 20. | kJ/mol | MKER | Wei, Tzeng, et al., 1990 | gas phase; from graph |
By formula: (H4N+ • 4CHN) + CHN = (H4N+ • 5CHN)
Quantity | Value | Units | Method | Reference | Comment |
---|---|---|---|---|---|
ΔrH° | 33. | kJ/mol | PHPMS | Deakyne, Knuth, et al., 1994 | gas phase |
Quantity | Value | Units | Method | Reference | Comment |
ΔrS° | 79.1 | J/mol*K | PHPMS | Deakyne, Knuth, et al., 1994 | gas phase |
By formula: (H4N+ • 5CHN) + CHN = (H4N+ • 6CHN)
Quantity | Value | Units | Method | Reference | Comment |
---|---|---|---|---|---|
ΔrH° | 31. | kJ/mol | PHPMS | Deakyne, Knuth, et al., 1994 | gas phase |
Quantity | Value | Units | Method | Reference | Comment |
ΔrS° | 83.3 | J/mol*K | PHPMS | Deakyne, Knuth, et al., 1994 | gas phase |
By formula: (H4N+ • CHN) + CHN = (H4N+ • 2CHN)
Quantity | Value | Units | Method | Reference | Comment |
---|---|---|---|---|---|
ΔrH° | 72.8 | kJ/mol | PHPMS | Deakyne, Knuth, et al., 1994 | gas phase |
Quantity | Value | Units | Method | Reference | Comment |
ΔrS° | 97.9 | J/mol*K | PHPMS | Deakyne, Knuth, et al., 1994 | gas phase |
By formula: (H4N+ • 9H3N) + H3N = (H4N+ • 10H3N)
Bond type: Hydrogen bond (positive ion to hydride)
Quantity | Value | Units | Method | Reference | Comment |
---|---|---|---|---|---|
ΔrH° | 20. | kJ/mol | MKER | Wei, Tzeng, et al., 1990 | gas phase; from graph |
By formula: (H4N+ • 6H3N) + H3N = (H4N+ • 7H3N)
Bond type: Hydrogen bond (positive ion to hydride)
Quantity | Value | Units | Method | Reference | Comment |
---|---|---|---|---|---|
ΔrH° | 20. | kJ/mol | MKER | Wei, Tzeng, et al., 1990 | gas phase; from graph |
By formula: (H4N+ • 7H3N) + H3N = (H4N+ • 8H3N)
Bond type: Hydrogen bond (positive ion to hydride)
Quantity | Value | Units | Method | Reference | Comment |
---|---|---|---|---|---|
ΔrH° | 20. | kJ/mol | MKER | Wei, Tzeng, et al., 1990 | gas phase; from graph |
By formula: (H4N+ • 8H3N) + H3N = (H4N+ • 9H3N)
Bond type: Hydrogen bond (positive ion to hydride)
Quantity | Value | Units | Method | Reference | Comment |
---|---|---|---|---|---|
ΔrH° | 20. | kJ/mol | MKER | Wei, Tzeng, et al., 1990 | gas phase; from graph |
By formula: H4N+ + C3HN = (H4N+ • C3HN)
Quantity | Value | Units | Method | Reference | Comment |
---|---|---|---|---|---|
ΔrH° | 95.8 | kJ/mol | PHPMS | Speller and Meot-Ner (Mautner), 1985 | gas phase |
Quantity | Value | Units | Method | Reference | Comment |
ΔrS° | 94.6 | J/mol*K | PHPMS | Speller and Meot-Ner (Mautner), 1985 | gas phase |
By formula: H4N+ + C4H7N = (H4N+ • C4H7N)
Quantity | Value | Units | Method | Reference | Comment |
---|---|---|---|---|---|
ΔrH° | 119. | kJ/mol | PHPMS | Speller and Meot-Ner (Mautner), 1985 | gas phase |
Quantity | Value | Units | Method | Reference | Comment |
ΔrS° | 90.4 | J/mol*K | PHPMS | Speller and Meot-Ner (Mautner), 1985 | gas phase |
By formula: H4N+ + C3H8O2 = (H4N+ • C3H8O2)
Quantity | Value | Units | Method | Reference | Comment |
---|---|---|---|---|---|
ΔrH° | 122. | kJ/mol | PHPMS | Meot-Ner (Mautner), Sieck, et al., 1996 | gas phase |
Quantity | Value | Units | Method | Reference | Comment |
ΔrS° | 105. | J/mol*K | PHPMS | Meot-Ner (Mautner), Sieck, et al., 1996 | gas phase |
By formula: H4N+ + C9H12 = (H4N+ • C9H12)
Quantity | Value | Units | Method | Reference | Comment |
---|---|---|---|---|---|
ΔrH° | 91.2 | kJ/mol | PHPMS | Deakyne and Meot-Ner (Mautner), 1985 | gas phase |
Quantity | Value | Units | Method | Reference | Comment |
ΔrS° | 88.7 | J/mol*K | PHPMS | Deakyne and Meot-Ner (Mautner), 1985 | gas phase |
By formula: H4N+ + C6H5F = (H4N+ • C6H5F)
Quantity | Value | Units | Method | Reference | Comment |
---|---|---|---|---|---|
ΔrH° | 60.2 | kJ/mol | PHPMS | Deakyne and Meot-Ner (Mautner), 1985 | gas phase |
Quantity | Value | Units | Method | Reference | Comment |
ΔrS° | 75.3 | J/mol*K | PHPMS | Deakyne and Meot-Ner (Mautner), 1985 | gas phase |
By formula: H4N+ + C3H6O = (H4N+ • C3H6O)
Quantity | Value | Units | Method | Reference | Comment |
---|---|---|---|---|---|
ΔrH° | 118. | kJ/mol | PHPMS | Meot-Ner (Mautner), Sieck, et al., 1996 | gas phase |
Quantity | Value | Units | Method | Reference | Comment |
ΔrS° | 110. | J/mol*K | PHPMS | Meot-Ner (Mautner), Sieck, et al., 1996 | gas phase |
By formula: H4N+ + C2H3N = (H4N+ • C2H3N)
Quantity | Value | Units | Method | Reference | Comment |
---|---|---|---|---|---|
ΔrH° | 115. | kJ/mol | PHPMS | Liebman, Romm, et al., 1991 | gas phase |
Quantity | Value | Units | Method | Reference | Comment |
ΔrS° | 101. | J/mol*K | PHPMS | Liebman, Romm, et al., 1991 | gas phase |
By formula: H4N+ + C6H6 = (H4N+ • C6H6)
Quantity | Value | Units | Method | Reference | Comment |
---|---|---|---|---|---|
ΔrH° | 80.8 | kJ/mol | PHPMS | Deakyne and Meot-Ner (Mautner), 1985 | gas phase |
Quantity | Value | Units | Method | Reference | Comment |
ΔrS° | 97.5 | J/mol*K | PHPMS | Deakyne and Meot-Ner (Mautner), 1985 | gas phase |
By formula: H4N+ + N2 = (H4N+ • N2)
Quantity | Value | Units | Method | Reference | Comment |
---|---|---|---|---|---|
ΔrH° | 50. ± 20. | kJ/mol | DT | Gheno and Fitaire, 1987 | gas phase |
Quantity | Value | Units | Method | Reference | Comment |
ΔrS° | 130. | J/mol*K | DT | Gheno and Fitaire, 1987 | gas phase |
By formula: (H4N+ • 2H2O) + O2S = (H4N+ • O2S • 2H2O)
Free energy of reaction
ΔrG° (kJ/mol) | T (K) | Method | Reference | Comment |
---|---|---|---|---|
21. | 300. | HPMS | Banic and Iribarne, 1985 | gas phase; electric fields |
By formula: (H4N+ • 3H2O) + O2S = (H4N+ • O2S • 3H2O)
Free energy of reaction
ΔrG° (kJ/mol) | T (K) | Method | Reference | Comment |
---|---|---|---|---|
15. | 300. | HPMS | Banic and Iribarne, 1985 | gas phase; electric fields |
By formula: (H4N+ • H2O) + O2S = (H4N+ • O2S • H2O)
Free energy of reaction
ΔrG° (kJ/mol) | T (K) | Method | Reference | Comment |
---|---|---|---|---|
27. | 300. | HPMS | Banic and Iribarne, 1985 | gas phase; electric fields |
By formula: (H4N+ • 2H2O) + CO2 = (H4N+ • CO2 • 2H2O)
Quantity | Value | Units | Method | Reference | Comment |
---|---|---|---|---|---|
ΔrG° | 5.4 | kJ/mol | HPMS | Banic and Iribarne, 1985 | gas phase; electric fields |
By formula: H4N+ + CO2 = (H4N+ • CO2)
Free energy of reaction
ΔrG° (kJ/mol) | T (K) | Method | Reference | Comment |
---|---|---|---|---|
9.6 | 296. | FA | Spears and Fehsenfeld, 1972 | gas phase |

References

Tzeng, Wei, et al., 1991
Tzeng, W.B.; Wei, S.; Castleman, A.W.,
Stability, Structure and Binding - Energies of Solvated Cluster Ions - Ammonia Acetonitrile and Ammonia Acetaldehyde Systems,
J. Phys. Chem., 1991, 95, 15, 5757, https://doi.org/10.1021/j100168a011
. [all data]
Meot-Ner (Mautner), Sieck, et al., 1996
Meot-Ner (Mautner), M.; Sieck, L.W.; Liebman, J.F.; Scheiner, S.,
Complexing of the Ammonium Ion by Polyethers. Comparative Complexing Thermochemistry of Ammonium, Hydronium, and Alkali Cations,
J. Phys. Chem., 1996, 100, 16, 6445, https://doi.org/10.1021/jp9514943
. [all data]
Deakyne, Knuth, et al., 1994
Deakyne, C.A.; Knuth, D.M.; Speller, C.V.; Meot-Ner (Mautner), M.; Sieck, L.W.,
Filling of Solvent Shells about Ions. Part 3. Isomeric Clusters of (HCN)n(NH3)mH+,
J. Mol. Structure (Theochem), 1994, 307, 217, https://doi.org/10.1016/0166-1280(94)80130-4
. [all data]
Liebman, Romm, et al., 1991
Liebman, J.F.; Romm, M.J.; Meot-Ner (Mautner), M.; Cybulski, S.M.; Scheiner, S.,
Isotropy in ionic interactions. 2. How spherical is the ammonium ion? Comparison of the gas-phase clustering energies and condensed-phase thermochemistry of K+ and NH4+,
J. Phys. Chem., 1991, 95, 3, 1112, https://doi.org/10.1021/j100156a018
. [all data]
Wei, Tzeng, et al., 1990
Wei, S.; Tzeng, W.B.; Castleman, A.W.,
Kinetic Energy Release Measurements of Ammonia Cluster Ions During Metastable Decomposition and Determination of Cluster Ion Binding Energies,
J. Chem. Phys., 1990, 92, 1, 332, https://doi.org/10.1063/1.458434
. [all data]
Speller and Meot-Ner (Mautner), 1985
Speller, C.V.; Meot-Ner (Mautner), M.,
The Ionic Hydrogen Bond and Ion Solvation. 3. Bonds Involving Cyanides. Correlations with Proton Affinites,
J. Phys. Chem., 1985, 81, 24, 5217, https://doi.org/10.1021/j100270a020
. [all data]
Deakyne and Meot-Ner (Mautner), 1985
Deakyne, C.A.; Meot-Ner (Mautner), M.,
Unconventional Ionic Hydrogen Bonds. 2. NH+ pi. Complexes of Onium Ions with Olefins and Benzene Derivatives,
J. Am. Chem. Soc., 1985, 107, 2, 474, https://doi.org/10.1021/ja00288a034
. [all data]
Gheno and Fitaire, 1987
Gheno, F.; Fitaire, M.,
Association of N2 with NH4+ and H3O+(H2O)n, n = 1,2,3,
J. Chem. Phys., 1987, 87, 2, 953, https://doi.org/10.1063/1.453250
. [all data]
Banic and Iribarne, 1985
Banic, C.M.; Iribarne, J.V.,
Equilibrium Constants for Clustering of Neutral Molecules about Gaseous Ions,
J. Chem. Phys., 1985, 83, 12, 6432, https://doi.org/10.1063/1.449543
. [all data]
Spears and Fehsenfeld, 1972
Spears, K.G.; Fehsenfeld, F.C.,
Termolecular Association Reactions of Mg, Ca, and Ba Ions,
J. Chem. Phys., 1972, 56, 11, 5698, https://doi.org/10.1063/1.1677091
. [all data]