Nitrogen oxide anion
- Formula: NO2-
- Molecular weight: 46.0060
- IUPAC Standard InChIKey: IOVCWXUNBOPUCH-UHFFFAOYSA-M
- CAS Registry Number: 14797-65-0
- Chemical structure:
View 3d structure (requires JavaScript / HTML 5) - Permanent link for this species. Use this link for bookmarking this species for future reference.

Gas phase thermochemistry data

Quantity | Value | Units | Method | Reference | Comment |
---|---|---|---|---|---|
S°gas,1 bar | 236.60 | J/mol*K | Review | Chase, 1998 | Data last reviewed in June, 1972 |

Reaction thermochemistry data

Data compiled as indicated in comments:
B - John E. Bartmess
M - Michael M. Meot-Ner (Mautner) and Sharon G. Lias
Individual Reactions
By formula: NO2- + H2O = (NO2- • H2O)
Bond type: Hydrogen bond (negative ion to hydride)
Quantity | Value | Units | Method | Reference | Comment |
---|---|---|---|---|---|
ΔrH° | 65. ± 20. | kJ/mol | AVG | N/A | Average of 6 values; Individual data points |
Quantity | Value | Units | Method | Reference | Comment |
ΔrS° | 84.9 | J/mol*K | PHPMS | Sieck, 1985 | gas phase; M |
ΔrS° | 83.7 | J/mol*K | FA | Bohringer, Fahey, et al., 1984 | gas phase; switching reaction(NO2-)H2O; Lee, Keesee, et al., 1980; M |
ΔrS° | 99.6 | J/mol*K | HPMS | Lee, Keesee, et al., 1980 | gas phase; M |
ΔrS° | 88. | J/mol*K | HPMS | Payzant, Yamdagni, et al., 1971 | gas phase; M |
Quantity | Value | Units | Method | Reference | Comment |
ΔrG° | 35.6 ± 0.84 | kJ/mol | TDAs | Sieck, 1985 | gas phase; B |
ΔrG° | 35.6 ± 1.3 | kJ/mol | TDAs | Blades, Klassen, et al., 1995 | gas phase; T: 293 K. ΔSaff approx. 24 cal/mol-K; B,M |
ΔrG° | 34. ± 24. | kJ/mol | Endo | Paulson and Dale, 1982 | gas phase; B |
ΔrG° | 33.9 ± 0.84 | kJ/mol | TDAs | Lee, Keesee, et al., 1980 | gas phase; B |
ΔrG° | 33.5 | kJ/mol | TDAs | Payzant, Yamdagni, et al., 1971 | gas phase; B |
Free energy of reaction
ΔrG° (kJ/mol) | T (K) | Method | Reference | Comment |
---|---|---|---|---|
33. | 296. | FA | Fehsenfeld and Ferguson, 1974 | gas phase; M |
35. | 300. | SAMS | Payzant, Cunningham, et al., 1972 | gas phase; M |
By formula: (NO2- • H2O) + H2O = (NO2- • 2H2O)
Bond type: Hydrogen bond (negative ion to hydride)
Quantity | Value | Units | Method | Reference | Comment |
---|---|---|---|---|---|
ΔrH° | 54.4 ± 6.3 | kJ/mol | TDAs | Blades, Klassen, et al., 1995 | gas phase; T: 293 K. ΔSaff approx. 24 cal/mol-K; B |
ΔrH° | 54.0 ± 4.2 | kJ/mol | TDAs | Payzant, Yamdagni, et al., 1971 | gas phase; B,M |
ΔrH° | 54.0 ± 4.2 | kJ/mol | TDAs | Arshadi, Yamdagni, et al., 1970 | gas phase; B |
ΔrH° | 56.9 | kJ/mol | HPMS | Lee, Keesee, et al., 1980 | gas phase; M |
Quantity | Value | Units | Method | Reference | Comment |
ΔrS° | 110. | J/mol*K | HPMS | Lee, Keesee, et al., 1980 | gas phase; M |
ΔrS° | 99.2 | J/mol*K | HPMS | Payzant, Yamdagni, et al., 1971 | gas phase; M |
Quantity | Value | Units | Method | Reference | Comment |
ΔrG° | 25.1 ± 1.3 | kJ/mol | TDAs | Blades, Klassen, et al., 1995 | gas phase; T: 293 K. ΔSaff approx. 24 cal/mol-K; B,M |
ΔrG° | 24. ± 5.9 | kJ/mol | TDAs | Payzant, Yamdagni, et al., 1971 | gas phase; B |
ΔrG° | 24.3 | kJ/mol | TDAs | Arshadi, Yamdagni, et al., 1970 | gas phase; B |
ΔrG° | 26. ± 8.4 | kJ/mol | TDAs | Kebarle, Arshadi, et al., 1968 | gas phase; B,M |
Free energy of reaction
ΔrG° (kJ/mol) | T (K) | Method | Reference | Comment |
---|---|---|---|---|
25. | 296. | FA | Fehsenfeld and Ferguson, 1974 | gas phase; M |
24. | 300. | SAMS | Payzant, Cunningham, et al., 1972 | gas phase; M |
By formula: (NO2- • 2H2O) + H2O = (NO2- • 3H2O)
Bond type: Hydrogen bond (negative ion to hydride)
Quantity | Value | Units | Method | Reference | Comment |
---|---|---|---|---|---|
ΔrH° | 48.1 ± 6.3 | kJ/mol | TDAs | Blades, Klassen, et al., 1995 | gas phase; T: 293 K. ΔSaff approx. 24 cal/mol-K; B |
ΔrH° | 43.5 ± 4.2 | kJ/mol | TDAs | Payzant, Yamdagni, et al., 1971 | gas phase; B,M |
ΔrH° | 43.5 ± 4.2 | kJ/mol | TDAs | Arshadi, Yamdagni, et al., 1970 | gas phase; B |
ΔrH° | 49.0 | kJ/mol | HPMS | Lee, Keesee, et al., 1980 | gas phase; M |
Quantity | Value | Units | Method | Reference | Comment |
ΔrS° | 108. | J/mol*K | HPMS | Lee, Keesee, et al., 1980 | gas phase; M |
ΔrS° | 88.7 | J/mol*K | HPMS | Payzant, Yamdagni, et al., 1971 | gas phase; M |
Quantity | Value | Units | Method | Reference | Comment |
ΔrG° | 18.8 ± 1.3 | kJ/mol | TDAs | Blades, Klassen, et al., 1995 | gas phase; T: 293 K. ΔSaff approx. 24 cal/mol-K; B,M |
ΔrG° | 17. ± 5.9 | kJ/mol | TDAs | Payzant, Yamdagni, et al., 1971 | gas phase; B |
ΔrG° | 17.2 | kJ/mol | TDAs | Arshadi, Yamdagni, et al., 1970 | gas phase; B |
ΔrG° | 19. ± 8.4 | kJ/mol | TDAs | Kebarle, Arshadi, et al., 1968 | gas phase; B,M |
By formula: NO2- + O2S = (NO2- • O2S)
Quantity | Value | Units | Method | Reference | Comment |
---|---|---|---|---|---|
ΔrH° | 108.4 ± 0.84 | kJ/mol | TDAs | Keesee, Lee, et al., 1980 | gas phase; B,M |
ΔrH° | 102. ± 4.2 | kJ/mol | TDEq | Bohringer, Fahey, et al., 1984 | gas phase; Relative to HOH..NO2-, Keesee, Lee, et al., 1980; B,M |
Quantity | Value | Units | Method | Reference | Comment |
ΔrS° | 154. | J/mol*K | HPMS | Keesee, Lee, et al., 1980 | gas phase; M |
ΔrS° | 132. | J/mol*K | N/A | Bohringer, Fahey, et al., 1984 | gas phase; switching reaction(NO2-)H2O, Entropy change calculated or estimated; Lee, Keesee, et al., 1980; M |
Quantity | Value | Units | Method | Reference | Comment |
ΔrG° | 62.3 ± 1.3 | kJ/mol | TDAs | Keesee, Lee, et al., 1980 | gas phase; B |
By formula: NO2- + CO2 = (NO2- • CO2)
Quantity | Value | Units | Method | Reference | Comment |
---|---|---|---|---|---|
ΔrH° | 30.5 ± 0.84 | kJ/mol | TDAs | Hiraoka and Yamabe, 1992 | gas phase; B,M |
ΔrH° | 38.9 ± 0.42 | kJ/mol | TDAs | Keesee, Lee, et al., 1980 | gas phase; B,M |
Quantity | Value | Units | Method | Reference | Comment |
ΔrS° | 72.0 | J/mol*K | PHPMS | Hiraoka and Yamabe, 1992 | gas phase; M |
ΔrS° | 101. | J/mol*K | HPMS | Keesee, Lee, et al., 1980 | gas phase; M |
Quantity | Value | Units | Method | Reference | Comment |
ΔrG° | 8.8 ± 8.4 | kJ/mol | TDAs | Hiraoka and Yamabe, 1992 | gas phase; B |
ΔrG° | 8.37 ± 0.84 | kJ/mol | TDAs | Keesee, Lee, et al., 1980 | gas phase; B |
By formula: NO2- + C2H6OS = (NO2- • C2H6OS)
Quantity | Value | Units | Method | Reference | Comment |
---|---|---|---|---|---|
ΔrH° | 80.3 ± 4.2 | kJ/mol | TDAs | Sieck, 1985 | gas phase; B,M |
Quantity | Value | Units | Method | Reference | Comment |
ΔrS° | 100. | J/mol*K | N/A | Sieck, 1985 | gas phase; Entropy change calculated or estimated; M |
Quantity | Value | Units | Method | Reference | Comment |
ΔrG° | 36. ± 4.2 | kJ/mol | TDAs | Sieck, 1985 | gas phase; B |
Free energy of reaction
ΔrG° (kJ/mol) | T (K) | Method | Reference | Comment |
---|---|---|---|---|
36. | 420. | PHPMS | Sieck, 1985 | gas phase; Entropy change calculated or estimated; M |
By formula: (NO2- • O2S) + O2S = (NO2- • 2O2S)
Quantity | Value | Units | Method | Reference | Comment |
---|---|---|---|---|---|
ΔrH° | 37.7 ± 0.84 | kJ/mol | TDAs | Keesee, Lee, et al., 1980 | gas phase; B,M |
ΔrH° | 41. | kJ/mol | HPMS | Wlodek, Luczynski, et al., 1983 | gas phase; M |
Quantity | Value | Units | Method | Reference | Comment |
ΔrS° | 90.0 | J/mol*K | HPMS | Wlodek, Luczynski, et al., 1983 | gas phase; M |
ΔrS° | 70.3 | J/mol*K | HPMS | Keesee, Lee, et al., 1980 | gas phase; M |
Quantity | Value | Units | Method | Reference | Comment |
ΔrG° | 16.7 ± 1.7 | kJ/mol | TDAs | Keesee, Lee, et al., 1980 | gas phase; B |
By formula: NO2- + CH3NO2 = (NO2- • CH3NO2)
Quantity | Value | Units | Method | Reference | Comment |
---|---|---|---|---|---|
ΔrH° | 60.7 ± 2.1 | kJ/mol | TDAs | Wincel, 2003 | gas phase; B |
ΔrH° | 59.83 ± 0.42 | kJ/mol | TDAs | Sieck, 1985 | gas phase; B,M |
Quantity | Value | Units | Method | Reference | Comment |
ΔrS° | 64.9 | J/mol*K | PHPMS | Sieck, 1985 | gas phase; M |
Quantity | Value | Units | Method | Reference | Comment |
ΔrG° | 32.6 | kJ/mol | TDAs | Wincel, 2003 | gas phase; B |
ΔrG° | 40.6 ± 0.84 | kJ/mol | TDAs | Sieck, 1985 | gas phase; B |
By formula: (NO2- • 4294967295NO2) + NO2 = NO2-
Quantity | Value | Units | Method | Reference | Comment |
---|---|---|---|---|---|
ΔrH° | 449.0 ± 1.3 | kJ/mol | N/A | Davidson, Fehsenfeld, et al., 1977 | gas phase; Relative to HBr, reevaluated with current HBr acidity. Excited state at 3.0 eV,81WU /TIE.; B |
ΔrH° | <192.9 | kJ/mol | PDis | Smith, Lee, et al., 1979 | gas phase; Isomer: O4- + NO ->.; B |
ΔrH° | 276. ± 21. | kJ/mol | PDis | Smith, Lee, et al., 1978 | gas phase; B |
By formula: (NO2- • 2O2S) + O2S = (NO2- • 3O2S)
Quantity | Value | Units | Method | Reference | Comment |
---|---|---|---|---|---|
ΔrH° | 27.6 ± 0.84 | kJ/mol | TDAs | Keesee, Lee, et al., 1980 | gas phase; B,M |
Quantity | Value | Units | Method | Reference | Comment |
ΔrS° | 56.1 | J/mol*K | HPMS | Keesee, Lee, et al., 1980 | gas phase; Entropy change is questionable; M |
Quantity | Value | Units | Method | Reference | Comment |
ΔrG° | 10.9 ± 3.3 | kJ/mol | TDAs | Keesee, Lee, et al., 1980 | gas phase; B |
By formula: NO2- + H2O2 = (NO2- • H2O2)
Quantity | Value | Units | Method | Reference | Comment |
---|---|---|---|---|---|
ΔrH° | 84.5 ± 4.2 | kJ/mol | TDEq | Bohringer, Fahey, et al., 1984 | gas phase; Relative to HOH..NO2-, Keesee, Lee, et al., 1980; B |
Quantity | Value | Units | Method | Reference | Comment |
ΔrG° | 59.8 ± 4.2 | kJ/mol | TDEq | Bohringer, Fahey, et al., 1984 | gas phase; Relative to HOH..NO2-, Keesee, Lee, et al., 1980; B |
By formula: (NO2- • 2CO2) + CO2 = (NO2- • 3CO2)
Quantity | Value | Units | Method | Reference | Comment |
---|---|---|---|---|---|
ΔrH° | 26. ± 4.2 | kJ/mol | TDAs | Hiraoka and Yamabe, 1992 | gas phase; B,M |
Quantity | Value | Units | Method | Reference | Comment |
ΔrS° | 97.5 | J/mol*K | PHPMS | Hiraoka and Yamabe, 1992 | gas phase; M |
Quantity | Value | Units | Method | Reference | Comment |
ΔrG° | -3. ± 4.2 | kJ/mol | TDAs | Hiraoka and Yamabe, 1992 | gas phase; B |
By formula: (NO2- • 3CO2) + CO2 = (NO2- • 4CO2)
Quantity | Value | Units | Method | Reference | Comment |
---|---|---|---|---|---|
ΔrH° | 25. ± 4.2 | kJ/mol | TDAs | Hiraoka and Yamabe, 1992 | gas phase; B,M |
Quantity | Value | Units | Method | Reference | Comment |
ΔrS° | 108. | J/mol*K | PHPMS | Hiraoka and Yamabe, 1992 | gas phase; M |
Quantity | Value | Units | Method | Reference | Comment |
ΔrG° | -7.1 ± 4.2 | kJ/mol | TDAs | Hiraoka and Yamabe, 1992 | gas phase; B |
By formula: (NO2- • 4CO2) + CO2 = (NO2- • 5CO2)
Quantity | Value | Units | Method | Reference | Comment |
---|---|---|---|---|---|
ΔrH° | 22. ± 4.2 | kJ/mol | TDAs | Hiraoka and Yamabe, 1992 | gas phase; B,M |
Quantity | Value | Units | Method | Reference | Comment |
ΔrS° | 97.5 | J/mol*K | PHPMS | Hiraoka and Yamabe, 1992 | gas phase; M |
Quantity | Value | Units | Method | Reference | Comment |
ΔrG° | -7.5 ± 4.2 | kJ/mol | TDAs | Hiraoka and Yamabe, 1992 | gas phase; B |
By formula: (NO2- • 5CO2) + CO2 = (NO2- • 6CO2)
Quantity | Value | Units | Method | Reference | Comment |
---|---|---|---|---|---|
ΔrH° | 21. ± 4.2 | kJ/mol | TDAs | Hiraoka and Yamabe, 1992 | gas phase; B,M |
Quantity | Value | Units | Method | Reference | Comment |
ΔrS° | 96.7 | J/mol*K | PHPMS | Hiraoka and Yamabe, 1992 | gas phase; M |
Quantity | Value | Units | Method | Reference | Comment |
ΔrG° | -8.4 ± 4.2 | kJ/mol | TDAs | Hiraoka and Yamabe, 1992 | gas phase; B |
By formula: (NO2- • 6CO2) + CO2 = (NO2- • 7CO2)
Quantity | Value | Units | Method | Reference | Comment |
---|---|---|---|---|---|
ΔrH° | 18. ± 4.2 | kJ/mol | TDAs | Hiraoka and Yamabe, 1992 | gas phase; B,M |
Quantity | Value | Units | Method | Reference | Comment |
ΔrS° | 90.8 | J/mol*K | PHPMS | Hiraoka and Yamabe, 1992 | gas phase; M |
Quantity | Value | Units | Method | Reference | Comment |
ΔrG° | -8.8 ± 4.2 | kJ/mol | TDAs | Hiraoka and Yamabe, 1992 | gas phase; B |
By formula: (NO2- • 7CO2) + CO2 = (NO2- • 8CO2)
Quantity | Value | Units | Method | Reference | Comment |
---|---|---|---|---|---|
ΔrH° | 18. ± 4.2 | kJ/mol | TDAs | Hiraoka and Yamabe, 1992 | gas phase; B,M |
Quantity | Value | Units | Method | Reference | Comment |
ΔrS° | 90.8 | J/mol*K | PHPMS | Hiraoka and Yamabe, 1992 | gas phase; M |
Quantity | Value | Units | Method | Reference | Comment |
ΔrG° | -9.6 ± 4.2 | kJ/mol | TDAs | Hiraoka and Yamabe, 1992 | gas phase; B |
By formula: (NO2- • CO2) + CO2 = (NO2- • 2CO2)
Quantity | Value | Units | Method | Reference | Comment |
---|---|---|---|---|---|
ΔrH° | 28. ± 4.2 | kJ/mol | TDAs | Hiraoka and Yamabe, 1992 | gas phase; B,M |
Quantity | Value | Units | Method | Reference | Comment |
ΔrS° | 79.5 | J/mol*K | PHPMS | Hiraoka and Yamabe, 1992 | gas phase; M |
Quantity | Value | Units | Method | Reference | Comment |
ΔrG° | 4.2 ± 4.2 | kJ/mol | TDAs | Hiraoka and Yamabe, 1992 | gas phase; B |
By formula: NO2- + C2H5NO3 = (NO2- • C2H5NO3)
Quantity | Value | Units | Method | Reference | Comment |
---|---|---|---|---|---|
ΔrH° | 87.4 | kJ/mol | HPMS | Wlodek, Luczynski, et al., 1983, 2 | gas phase; switching reaction(NO2-)SO2; Keesee, Lee, et al., 1980; M |
Quantity | Value | Units | Method | Reference | Comment |
ΔrS° | 148. | J/mol*K | HPMS | Wlodek, Luczynski, et al., 1983, 2 | gas phase; switching reaction(NO2-)SO2; Keesee, Lee, et al., 1980; M |
By formula: NO2- + C7H3N3O4 = (NO2- • C7H3N3O4)
Quantity | Value | Units | Method | Reference | Comment |
---|---|---|---|---|---|
ΔrH° | 98.3 ± 8.4 | kJ/mol | TDAs | Grimsrud, Chowdhury, et al., 1986 | gas phase; B,M |
Quantity | Value | Units | Method | Reference | Comment |
ΔrS° | 99.2 | J/mol*K | PHPMS | Grimsrud, Chowdhury, et al., 1986 | gas phase; M |
Quantity | Value | Units | Method | Reference | Comment |
ΔrG° | 68.6 ± 8.4 | kJ/mol | TDAs | Grimsrud, Chowdhury, et al., 1986 | gas phase; B |
By formula: NO2- + C7H4N2O2 = (NO2- • C7H4N2O2)
Quantity | Value | Units | Method | Reference | Comment |
---|---|---|---|---|---|
ΔrH° | 83.7 ± 8.4 | kJ/mol | TDAs | Grimsrud, Chowdhury, et al., 1986 | gas phase; B,M |
Quantity | Value | Units | Method | Reference | Comment |
ΔrS° | 83.7 | J/mol*K | PHPMS | Grimsrud, Chowdhury, et al., 1986 | gas phase; M |
Quantity | Value | Units | Method | Reference | Comment |
ΔrG° | 58.6 ± 8.4 | kJ/mol | TDAs | Grimsrud, Chowdhury, et al., 1986 | gas phase; B |
By formula: NO2- + C7H4N2O2 = (NO2- • C7H4N2O2)
Quantity | Value | Units | Method | Reference | Comment |
---|---|---|---|---|---|
ΔrH° | 78.7 ± 8.4 | kJ/mol | TDAs | Grimsrud, Chowdhury, et al., 1986 | gas phase; B,M |
Quantity | Value | Units | Method | Reference | Comment |
ΔrS° | 90.0 | J/mol*K | PHPMS | Grimsrud, Chowdhury, et al., 1986 | gas phase; M |
Quantity | Value | Units | Method | Reference | Comment |
ΔrG° | 51.9 ± 8.4 | kJ/mol | TDAs | Grimsrud, Chowdhury, et al., 1986 | gas phase; B |
By formula: NO2- + C6H4FNO2 = (NO2- • C6H4FNO2)
Quantity | Value | Units | Method | Reference | Comment |
---|---|---|---|---|---|
ΔrH° | 62.8 ± 8.4 | kJ/mol | TDAs | Grimsrud, Chowdhury, et al., 1986 | gas phase; B,M |
Quantity | Value | Units | Method | Reference | Comment |
ΔrS° | 82.0 | J/mol*K | PHPMS | Grimsrud, Chowdhury, et al., 1986 | gas phase; M |
Quantity | Value | Units | Method | Reference | Comment |
ΔrG° | 38. ± 8.4 | kJ/mol | TDAs | Grimsrud, Chowdhury, et al., 1986 | gas phase; B |
By formula: NO2- + C6H4N2O4 = (NO2- • C6H4N2O4)
Quantity | Value | Units | Method | Reference | Comment |
---|---|---|---|---|---|
ΔrH° | 88.7 ± 8.4 | kJ/mol | TDAs | Grimsrud, Chowdhury, et al., 1986 | gas phase; B,M |
Quantity | Value | Units | Method | Reference | Comment |
ΔrS° | 94.6 | J/mol*K | PHPMS | Grimsrud, Chowdhury, et al., 1986 | gas phase; M |
Quantity | Value | Units | Method | Reference | Comment |
ΔrG° | 60.2 ± 8.4 | kJ/mol | TDAs | Grimsrud, Chowdhury, et al., 1986 | gas phase; B |
By formula: NO2- + C6H5NO2 = (NO2- • C6H5NO2)
Quantity | Value | Units | Method | Reference | Comment |
---|---|---|---|---|---|
ΔrH° | 59.4 ± 8.4 | kJ/mol | TDAs | Grimsrud, Chowdhury, et al., 1986 | gas phase; B,M |
Quantity | Value | Units | Method | Reference | Comment |
ΔrS° | 73.2 | J/mol*K | PHPMS | Grimsrud, Chowdhury, et al., 1986 | gas phase; M |
Quantity | Value | Units | Method | Reference | Comment |
ΔrG° | 37. ± 8.4 | kJ/mol | TDAs | Grimsrud, Chowdhury, et al., 1986 | gas phase; B |
By formula: NO2- + C4H10O = (NO2- • C4H10O)
Quantity | Value | Units | Method | Reference | Comment |
---|---|---|---|---|---|
ΔrH° | 82.01 ± 0.84 | kJ/mol | TDAs | Sieck, 1985 | gas phase; B,M |
Quantity | Value | Units | Method | Reference | Comment |
ΔrS° | 123. | J/mol*K | PHPMS | Sieck, 1985 | gas phase; M |
Quantity | Value | Units | Method | Reference | Comment |
ΔrG° | 45.2 ± 1.3 | kJ/mol | TDAs | Sieck, 1985 | gas phase; B |
By formula: NO2- + CH4O = (NO2- • CH4O)
Quantity | Value | Units | Method | Reference | Comment |
---|---|---|---|---|---|
ΔrH° | 72.80 ± 0.84 | kJ/mol | TDAs | Sieck, 1985 | gas phase; B,M |
Quantity | Value | Units | Method | Reference | Comment |
ΔrS° | 108. | J/mol*K | PHPMS | Sieck, 1985 | gas phase; M |
Quantity | Value | Units | Method | Reference | Comment |
ΔrG° | 40.6 ± 1.7 | kJ/mol | TDAs | Sieck, 1985 | gas phase; B |
By formula: NO2- + C3H6O = (NO2- • C3H6O)
Quantity | Value | Units | Method | Reference | Comment |
---|---|---|---|---|---|
ΔrH° | 66.53 ± 0.42 | kJ/mol | TDAs | Sieck, 1985 | gas phase; B,M |
Quantity | Value | Units | Method | Reference | Comment |
ΔrS° | 108. | J/mol*K | PHPMS | Sieck, 1985 | gas phase; M |
Quantity | Value | Units | Method | Reference | Comment |
ΔrG° | 34.3 ± 0.84 | kJ/mol | TDAs | Sieck, 1985 | gas phase; B |
By formula: NO2- + C2H3N = (NO2- • C2H3N)
Quantity | Value | Units | Method | Reference | Comment |
---|---|---|---|---|---|
ΔrH° | 56.07 ± 0.42 | kJ/mol | TDAs | Sieck, 1985 | gas phase; B,M |
Quantity | Value | Units | Method | Reference | Comment |
ΔrS° | 64.0 | J/mol*K | PHPMS | Sieck, 1985 | gas phase; M |
Quantity | Value | Units | Method | Reference | Comment |
ΔrG° | 36.8 ± 0.84 | kJ/mol | TDAs | Sieck, 1985 | gas phase; B |
By formula: NO2- + H2Se = (NO2- • H2Se)
Quantity | Value | Units | Method | Reference | Comment |
---|---|---|---|---|---|
ΔrH° | 87.4 ± 4.2 | kJ/mol | TDEq | Wlodek, Luczynski, et al., 1983, 2 | gas phase; Equilibration with SO2..NO2-; B |
Quantity | Value | Units | Method | Reference | Comment |
ΔrG° | 43. ± 15. | kJ/mol | TDEq | Wlodek, Luczynski, et al., 1983, 2 | gas phase; Equilibration with SO2..NO2-; B |
By formula: (NO2- • O2S) + C2H5NO3 = (NO2- • C2H5NO3 • O2S)
Quantity | Value | Units | Method | Reference | Comment |
---|---|---|---|---|---|
ΔrH° | 31. | kJ/mol | HPMS | Wlodek, Luczynski, et al., 1983 | gas phase; Entropy change is questionable; M |
Quantity | Value | Units | Method | Reference | Comment |
ΔrS° | 43.5 | J/mol*K | HPMS | Wlodek, Luczynski, et al., 1983 | gas phase; Entropy change is questionable; M |
By formula: (NO2- • 2C2H5NO3) + C2H5NO3 = (NO2- • 3C2H5NO3)
Quantity | Value | Units | Method | Reference | Comment |
---|---|---|---|---|---|
ΔrH° | 31. | kJ/mol | HPMS | Wlodek, Luczynski, et al., 1983, 2 | gas phase; Entropy change is questionable; M |
Quantity | Value | Units | Method | Reference | Comment |
ΔrS° | 59.0 | J/mol*K | HPMS | Wlodek, Luczynski, et al., 1983, 2 | gas phase; Entropy change is questionable; M |
By formula: (NO2- • C2H5NO3) + C2H5NO3 = (NO2- • 2C2H5NO3)
Quantity | Value | Units | Method | Reference | Comment |
---|---|---|---|---|---|
ΔrH° | 36. | kJ/mol | HPMS | Wlodek, Luczynski, et al., 1983, 2 | gas phase; Entropy change is questionable; M |
Quantity | Value | Units | Method | Reference | Comment |
ΔrS° | 53.6 | J/mol*K | HPMS | Wlodek, Luczynski, et al., 1983, 2 | gas phase; Entropy change is questionable; M |
By formula: (NO2- • 2H2Se) + H2Se = (NO2- • 3H2Se)
Quantity | Value | Units | Method | Reference | Comment |
---|---|---|---|---|---|
ΔrH° | 30.5 ± 2.9 | kJ/mol | TDAs | Wlodek, Luczynski, et al., 1983, 2 | gas phase; B |
Quantity | Value | Units | Method | Reference | Comment |
ΔrG° | 13.0 ± 2.1 | kJ/mol | TDAs | Wlodek, Luczynski, et al., 1983, 2 | gas phase; B |
By formula: (NO2- • H2Se) + H2Se = (NO2- • 2H2Se)
Quantity | Value | Units | Method | Reference | Comment |
---|---|---|---|---|---|
ΔrH° | 35.6 ± 2.1 | kJ/mol | TDAs | Wlodek, Luczynski, et al., 1983, 2 | gas phase; B |
Quantity | Value | Units | Method | Reference | Comment |
ΔrG° | 19.7 ± 1.3 | kJ/mol | TDAs | Wlodek, Luczynski, et al., 1983, 2 | gas phase; B |
By formula: (NO2- • 3H2O) + H2O = (NO2- • 4H2O)
Quantity | Value | Units | Method | Reference | Comment |
---|---|---|---|---|---|
ΔrH° | 48.5 | kJ/mol | HPMS | Lee, Keesee, et al., 1980 | gas phase; M |
Quantity | Value | Units | Method | Reference | Comment |
ΔrS° | 121. | J/mol*K | HPMS | Lee, Keesee, et al., 1980 | gas phase; M |
By formula: NO2- + C7H7NO3 = (NO2- • C7H7NO3)
Quantity | Value | Units | Method | Reference | Comment |
---|---|---|---|---|---|
ΔrH° | 85.8 ± 8.4 | kJ/mol | TDAs | Grimsrud, Chowdhury, et al., 1986 | gas phase; B |
Quantity | Value | Units | Method | Reference | Comment |
ΔrG° | 52.7 ± 8.4 | kJ/mol | TDAs | Grimsrud, Chowdhury, et al., 1986 | gas phase; B |
Quantity | Value | Units | Method | Reference | Comment |
---|---|---|---|---|---|
ΔrH° | 1423.5 ± 0.88 | kJ/mol | D-EA | Ervin, Ho, et al., 1988 | gas phase; B |
Quantity | Value | Units | Method | Reference | Comment |
ΔrG° | 1396.3 ± 1.3 | kJ/mol | H-TS | Ervin, Ho, et al., 1988 | gas phase; B |
+
= C2H5N2O4-
By formula: NO2- + C2H5NO2 = C2H5N2O4-
Quantity | Value | Units | Method | Reference | Comment |
---|---|---|---|---|---|
ΔrH° | 66.1 ± 2.1 | kJ/mol | TDAs | Wincel, 2004 | gas phase; B |
Quantity | Value | Units | Method | Reference | Comment |
ΔrG° | 37.2 | kJ/mol | TDAs | Wincel, 2004 | gas phase; B |
By formula: NO2- + C7H7NO3 = (NO2- • C7H7NO3)
Quantity | Value | Units | Method | Reference | Comment |
---|---|---|---|---|---|
ΔrH° | 85.8 | kJ/mol | PHPMS | Grimsrud, Chowdhury, et al., 1986 | gas phase; M |
Quantity | Value | Units | Method | Reference | Comment |
ΔrS° | 110. | J/mol*K | PHPMS | Grimsrud, Chowdhury, et al., 1986 | gas phase; M |
By formula: NO2- + HNO2 = (NO2- • HNO2)
Quantity | Value | Units | Method | Reference | Comment |
---|---|---|---|---|---|
ΔrH° | 136. ± 4.2 | kJ/mol | TDAs | Lee, Keesee, et al., 1980 | gas phase; B |
+
= C4H8NO4-
By formula: NO2- + C4H8O2 = C4H8NO4-
Quantity | Value | Units | Method | Reference | Comment |
---|---|---|---|---|---|
ΔrG° | 55.65 ± 0.84 | kJ/mol | IMRE | Viidanoja, Reiner, et al., 2000 | gas phase; B |
+
= C3H6NO4-
By formula: NO2- + C3H6O2 = C3H6NO4-
Quantity | Value | Units | Method | Reference | Comment |
---|---|---|---|---|---|
ΔrG° | 52.30 ± 0.84 | kJ/mol | IMRE | Viidanoja, Reiner, et al., 2000 | gas phase; B |
+
= C2H4NO4-
By formula: NO2- + C2H4O2 = C2H4NO4-
Quantity | Value | Units | Method | Reference | Comment |
---|---|---|---|---|---|
ΔrG° | 51.04 ± 0.84 | kJ/mol | IMRE | Viidanoja, Reiner, et al., 1998 | gas phase; B |

Gas phase ion energetics data

Data compiled by: John E. Bartmess
Protonation reactions
Quantity | Value | Units | Method | Reference | Comment |
---|---|---|---|---|---|
ΔrH° | 1423.5 ± 0.88 | kJ/mol | D-EA | Ervin, Ho, et al., 1988 | gas phase |
Quantity | Value | Units | Method | Reference | Comment |
ΔrG° | 1396.3 ± 1.3 | kJ/mol | H-TS | Ervin, Ho, et al., 1988 | gas phase |

Ion clustering data

Data compiled as indicated in comments:
B - John E. Bartmess
M - Michael M. Meot-Ner (Mautner) and Sharon G. Lias
Clustering reactions
By formula: NO2- + CH3NO2 = (NO2- • CH3NO2)
Quantity | Value | Units | Method | Reference | Comment |
---|---|---|---|---|---|
ΔrH° | 14.50 ± 0.50 | kcal/mol | TDAs | Wincel, 2003 | gas phase; B |
ΔrH° | 14.30 ± 0.10 | kcal/mol | TDAs | Sieck, 1985 | gas phase; B,M |
Quantity | Value | Units | Method | Reference | Comment |
ΔrS° | 15.5 | cal/mol*K | PHPMS | Sieck, 1985 | gas phase; M |
Quantity | Value | Units | Method | Reference | Comment |
ΔrG° | 7.80 | kcal/mol | TDAs | Wincel, 2003 | gas phase; B |
ΔrG° | 9.70 ± 0.20 | kcal/mol | TDAs | Sieck, 1985 | gas phase; B |
By formula: NO2- + CH4O = (NO2- • CH4O)
Quantity | Value | Units | Method | Reference | Comment |
---|---|---|---|---|---|
ΔrH° | 17.40 ± 0.20 | kcal/mol | TDAs | Sieck, 1985 | gas phase; B,M |
Quantity | Value | Units | Method | Reference | Comment |
ΔrS° | 25.8 | cal/mol*K | PHPMS | Sieck, 1985 | gas phase; M |
Quantity | Value | Units | Method | Reference | Comment |
ΔrG° | 9.70 ± 0.40 | kcal/mol | TDAs | Sieck, 1985 | gas phase; B |
By formula: NO2- + CO2 = (NO2- • CO2)
Quantity | Value | Units | Method | Reference | Comment |
---|---|---|---|---|---|
ΔrH° | 7.30 ± 0.20 | kcal/mol | TDAs | Hiraoka and Yamabe, 1992 | gas phase; B,M |
ΔrH° | 9.30 ± 0.10 | kcal/mol | TDAs | Keesee, Lee, et al., 1980 | gas phase; B,M |
Quantity | Value | Units | Method | Reference | Comment |
ΔrS° | 17.2 | cal/mol*K | PHPMS | Hiraoka and Yamabe, 1992 | gas phase; M |
ΔrS° | 24.2 | cal/mol*K | HPMS | Keesee, Lee, et al., 1980 | gas phase; M |
Quantity | Value | Units | Method | Reference | Comment |
ΔrG° | 2.1 ± 2.0 | kcal/mol | TDAs | Hiraoka and Yamabe, 1992 | gas phase; B |
ΔrG° | 2.00 ± 0.20 | kcal/mol | TDAs | Keesee, Lee, et al., 1980 | gas phase; B |
By formula: (NO2- • CO2) + CO2 = (NO2- • 2CO2)
Quantity | Value | Units | Method | Reference | Comment |
---|---|---|---|---|---|
ΔrH° | 6.7 ± 1.0 | kcal/mol | TDAs | Hiraoka and Yamabe, 1992 | gas phase; B,M |
Quantity | Value | Units | Method | Reference | Comment |
ΔrS° | 19.0 | cal/mol*K | PHPMS | Hiraoka and Yamabe, 1992 | gas phase; M |
Quantity | Value | Units | Method | Reference | Comment |
ΔrG° | 1.0 ± 1.0 | kcal/mol | TDAs | Hiraoka and Yamabe, 1992 | gas phase; B |
By formula: (NO2- • 2CO2) + CO2 = (NO2- • 3CO2)
Quantity | Value | Units | Method | Reference | Comment |
---|---|---|---|---|---|
ΔrH° | 6.3 ± 1.0 | kcal/mol | TDAs | Hiraoka and Yamabe, 1992 | gas phase; B,M |
Quantity | Value | Units | Method | Reference | Comment |
ΔrS° | 23.3 | cal/mol*K | PHPMS | Hiraoka and Yamabe, 1992 | gas phase; M |
Quantity | Value | Units | Method | Reference | Comment |
ΔrG° | -0.7 ± 1.0 | kcal/mol | TDAs | Hiraoka and Yamabe, 1992 | gas phase; B |
By formula: (NO2- • 3CO2) + CO2 = (NO2- • 4CO2)
Quantity | Value | Units | Method | Reference | Comment |
---|---|---|---|---|---|
ΔrH° | 6.0 ± 1.0 | kcal/mol | TDAs | Hiraoka and Yamabe, 1992 | gas phase; B,M |
Quantity | Value | Units | Method | Reference | Comment |
ΔrS° | 25.9 | cal/mol*K | PHPMS | Hiraoka and Yamabe, 1992 | gas phase; M |
Quantity | Value | Units | Method | Reference | Comment |
ΔrG° | -1.7 ± 1.0 | kcal/mol | TDAs | Hiraoka and Yamabe, 1992 | gas phase; B |
By formula: (NO2- • 4CO2) + CO2 = (NO2- • 5CO2)
Quantity | Value | Units | Method | Reference | Comment |
---|---|---|---|---|---|
ΔrH° | 5.2 ± 1.0 | kcal/mol | TDAs | Hiraoka and Yamabe, 1992 | gas phase; B,M |
Quantity | Value | Units | Method | Reference | Comment |
ΔrS° | 23.3 | cal/mol*K | PHPMS | Hiraoka and Yamabe, 1992 | gas phase; M |
Quantity | Value | Units | Method | Reference | Comment |
ΔrG° | -1.8 ± 1.0 | kcal/mol | TDAs | Hiraoka and Yamabe, 1992 | gas phase; B |
By formula: (NO2- • 5CO2) + CO2 = (NO2- • 6CO2)
Quantity | Value | Units | Method | Reference | Comment |
---|---|---|---|---|---|
ΔrH° | 4.9 ± 1.0 | kcal/mol | TDAs | Hiraoka and Yamabe, 1992 | gas phase; B,M |
Quantity | Value | Units | Method | Reference | Comment |
ΔrS° | 23.1 | cal/mol*K | PHPMS | Hiraoka and Yamabe, 1992 | gas phase; M |
Quantity | Value | Units | Method | Reference | Comment |
ΔrG° | -2.0 ± 1.0 | kcal/mol | TDAs | Hiraoka and Yamabe, 1992 | gas phase; B |
By formula: (NO2- • 6CO2) + CO2 = (NO2- • 7CO2)
Quantity | Value | Units | Method | Reference | Comment |
---|---|---|---|---|---|
ΔrH° | 4.4 ± 1.0 | kcal/mol | TDAs | Hiraoka and Yamabe, 1992 | gas phase; B,M |
Quantity | Value | Units | Method | Reference | Comment |
ΔrS° | 21.7 | cal/mol*K | PHPMS | Hiraoka and Yamabe, 1992 | gas phase; M |
Quantity | Value | Units | Method | Reference | Comment |
ΔrG° | -2.1 ± 1.0 | kcal/mol | TDAs | Hiraoka and Yamabe, 1992 | gas phase; B |
By formula: (NO2- • 7CO2) + CO2 = (NO2- • 8CO2)
Quantity | Value | Units | Method | Reference | Comment |
---|---|---|---|---|---|
ΔrH° | 4.2 ± 1.0 | kcal/mol | TDAs | Hiraoka and Yamabe, 1992 | gas phase; B,M |
Quantity | Value | Units | Method | Reference | Comment |
ΔrS° | 21.7 | cal/mol*K | PHPMS | Hiraoka and Yamabe, 1992 | gas phase; M |
Quantity | Value | Units | Method | Reference | Comment |
ΔrG° | -2.3 ± 1.0 | kcal/mol | TDAs | Hiraoka and Yamabe, 1992 | gas phase; B |
By formula: NO2- + C2H3N = (NO2- • C2H3N)
Quantity | Value | Units | Method | Reference | Comment |
---|---|---|---|---|---|
ΔrH° | 13.40 ± 0.10 | kcal/mol | TDAs | Sieck, 1985 | gas phase; B,M |
Quantity | Value | Units | Method | Reference | Comment |
ΔrS° | 15.3 | cal/mol*K | PHPMS | Sieck, 1985 | gas phase; M |
Quantity | Value | Units | Method | Reference | Comment |
ΔrG° | 8.80 ± 0.20 | kcal/mol | TDAs | Sieck, 1985 | gas phase; B |
+
= C2H4NO4-
By formula: NO2- + C2H4O2 = C2H4NO4-
Quantity | Value | Units | Method | Reference | Comment |
---|---|---|---|---|---|
ΔrG° | 12.20 ± 0.20 | kcal/mol | IMRE | Viidanoja, Reiner, et al., 1998 | gas phase; B |
+
= C2H5N2O4-
By formula: NO2- + C2H5NO2 = C2H5N2O4-
Quantity | Value | Units | Method | Reference | Comment |
---|---|---|---|---|---|
ΔrH° | 15.80 ± 0.50 | kcal/mol | TDAs | Wincel, 2004 | gas phase; B |
Quantity | Value | Units | Method | Reference | Comment |
ΔrG° | 8.90 | kcal/mol | TDAs | Wincel, 2004 | gas phase; B |
By formula: NO2- + C2H5NO3 = (NO2- • C2H5NO3)
Quantity | Value | Units | Method | Reference | Comment |
---|---|---|---|---|---|
ΔrH° | 20.9 | kcal/mol | HPMS | Wlodek, Luczynski, et al., 1983, 2 | gas phase; switching reaction(NO2-)SO2; Keesee, Lee, et al., 1980; M |
Quantity | Value | Units | Method | Reference | Comment |
ΔrS° | 35.3 | cal/mol*K | HPMS | Wlodek, Luczynski, et al., 1983, 2 | gas phase; switching reaction(NO2-)SO2; Keesee, Lee, et al., 1980; M |
By formula: (NO2- • C2H5NO3) + C2H5NO3 = (NO2- • 2C2H5NO3)
Quantity | Value | Units | Method | Reference | Comment |
---|---|---|---|---|---|
ΔrH° | 8.5 | kcal/mol | HPMS | Wlodek, Luczynski, et al., 1983, 2 | gas phase; Entropy change is questionable; M |
Quantity | Value | Units | Method | Reference | Comment |
ΔrS° | 12.8 | cal/mol*K | HPMS | Wlodek, Luczynski, et al., 1983, 2 | gas phase; Entropy change is questionable; M |
By formula: (NO2- • 2C2H5NO3) + C2H5NO3 = (NO2- • 3C2H5NO3)
Quantity | Value | Units | Method | Reference | Comment |
---|---|---|---|---|---|
ΔrH° | 7.3 | kcal/mol | HPMS | Wlodek, Luczynski, et al., 1983, 2 | gas phase; Entropy change is questionable; M |
Quantity | Value | Units | Method | Reference | Comment |
ΔrS° | 14.1 | cal/mol*K | HPMS | Wlodek, Luczynski, et al., 1983, 2 | gas phase; Entropy change is questionable; M |
By formula: NO2- + C2H6OS = (NO2- • C2H6OS)
Quantity | Value | Units | Method | Reference | Comment |
---|---|---|---|---|---|
ΔrH° | 19.2 ± 1.0 | kcal/mol | TDAs | Sieck, 1985 | gas phase; B,M |
Quantity | Value | Units | Method | Reference | Comment |
ΔrS° | 25. | cal/mol*K | N/A | Sieck, 1985 | gas phase; Entropy change calculated or estimated; M |
Quantity | Value | Units | Method | Reference | Comment |
ΔrG° | 8.7 ± 1.0 | kcal/mol | TDAs | Sieck, 1985 | gas phase; B |
Free energy of reaction
ΔrG° (kcal/mol) | T (K) | Method | Reference | Comment |
---|---|---|---|---|
8.7 | 420. | PHPMS | Sieck, 1985 | gas phase; Entropy change calculated or estimated; M |
By formula: NO2- + C3H6O = (NO2- • C3H6O)
Quantity | Value | Units | Method | Reference | Comment |
---|---|---|---|---|---|
ΔrH° | 15.90 ± 0.10 | kcal/mol | TDAs | Sieck, 1985 | gas phase; B,M |
Quantity | Value | Units | Method | Reference | Comment |
ΔrS° | 25.9 | cal/mol*K | PHPMS | Sieck, 1985 | gas phase; M |
Quantity | Value | Units | Method | Reference | Comment |
ΔrG° | 8.20 ± 0.20 | kcal/mol | TDAs | Sieck, 1985 | gas phase; B |
+
= C3H6NO4-
By formula: NO2- + C3H6O2 = C3H6NO4-
Quantity | Value | Units | Method | Reference | Comment |
---|---|---|---|---|---|
ΔrG° | 12.50 ± 0.20 | kcal/mol | IMRE | Viidanoja, Reiner, et al., 2000 | gas phase; B |
+
= C4H8NO4-
By formula: NO2- + C4H8O2 = C4H8NO4-
Quantity | Value | Units | Method | Reference | Comment |
---|---|---|---|---|---|
ΔrG° | 13.30 ± 0.20 | kcal/mol | IMRE | Viidanoja, Reiner, et al., 2000 | gas phase; B |
By formula: NO2- + C4H10O = (NO2- • C4H10O)
Quantity | Value | Units | Method | Reference | Comment |
---|---|---|---|---|---|
ΔrH° | 19.60 ± 0.20 | kcal/mol | TDAs | Sieck, 1985 | gas phase; B,M |
Quantity | Value | Units | Method | Reference | Comment |
ΔrS° | 29.5 | cal/mol*K | PHPMS | Sieck, 1985 | gas phase; M |
Quantity | Value | Units | Method | Reference | Comment |
ΔrG° | 10.80 ± 0.30 | kcal/mol | TDAs | Sieck, 1985 | gas phase; B |
By formula: NO2- + C6H4FNO2 = (NO2- • C6H4FNO2)
Quantity | Value | Units | Method | Reference | Comment |
---|---|---|---|---|---|
ΔrH° | 15.0 ± 2.0 | kcal/mol | TDAs | Grimsrud, Chowdhury, et al., 1986 | gas phase; B,M |
Quantity | Value | Units | Method | Reference | Comment |
ΔrS° | 19.6 | cal/mol*K | PHPMS | Grimsrud, Chowdhury, et al., 1986 | gas phase; M |
Quantity | Value | Units | Method | Reference | Comment |
ΔrG° | 9.1 ± 2.0 | kcal/mol | TDAs | Grimsrud, Chowdhury, et al., 1986 | gas phase; B |
By formula: NO2- + C6H4N2O4 = (NO2- • C6H4N2O4)
Quantity | Value | Units | Method | Reference | Comment |
---|---|---|---|---|---|
ΔrH° | 21.2 ± 2.0 | kcal/mol | TDAs | Grimsrud, Chowdhury, et al., 1986 | gas phase; B,M |
Quantity | Value | Units | Method | Reference | Comment |
ΔrS° | 22.6 | cal/mol*K | PHPMS | Grimsrud, Chowdhury, et al., 1986 | gas phase; M |
Quantity | Value | Units | Method | Reference | Comment |
ΔrG° | 14.4 ± 2.0 | kcal/mol | TDAs | Grimsrud, Chowdhury, et al., 1986 | gas phase; B |
By formula: NO2- + C6H5NO2 = (NO2- • C6H5NO2)
Quantity | Value | Units | Method | Reference | Comment |
---|---|---|---|---|---|
ΔrH° | 14.2 ± 2.0 | kcal/mol | TDAs | Grimsrud, Chowdhury, et al., 1986 | gas phase; B,M |
Quantity | Value | Units | Method | Reference | Comment |
ΔrS° | 17.5 | cal/mol*K | PHPMS | Grimsrud, Chowdhury, et al., 1986 | gas phase; M |
Quantity | Value | Units | Method | Reference | Comment |
ΔrG° | 8.9 ± 2.0 | kcal/mol | TDAs | Grimsrud, Chowdhury, et al., 1986 | gas phase; B |
By formula: NO2- + C7H3N3O4 = (NO2- • C7H3N3O4)
Quantity | Value | Units | Method | Reference | Comment |
---|---|---|---|---|---|
ΔrH° | 23.5 ± 2.0 | kcal/mol | TDAs | Grimsrud, Chowdhury, et al., 1986 | gas phase; B,M |
Quantity | Value | Units | Method | Reference | Comment |
ΔrS° | 23.7 | cal/mol*K | PHPMS | Grimsrud, Chowdhury, et al., 1986 | gas phase; M |
Quantity | Value | Units | Method | Reference | Comment |
ΔrG° | 16.4 ± 2.0 | kcal/mol | TDAs | Grimsrud, Chowdhury, et al., 1986 | gas phase; B |
By formula: NO2- + C7H4N2O2 = (NO2- • C7H4N2O2)
Quantity | Value | Units | Method | Reference | Comment |
---|---|---|---|---|---|
ΔrH° | 20.0 ± 2.0 | kcal/mol | TDAs | Grimsrud, Chowdhury, et al., 1986 | gas phase; B,M |
Quantity | Value | Units | Method | Reference | Comment |
ΔrS° | 20.0 | cal/mol*K | PHPMS | Grimsrud, Chowdhury, et al., 1986 | gas phase; M |
Quantity | Value | Units | Method | Reference | Comment |
ΔrG° | 14.0 ± 2.0 | kcal/mol | TDAs | Grimsrud, Chowdhury, et al., 1986 | gas phase; B |
By formula: NO2- + C7H4N2O2 = (NO2- • C7H4N2O2)
Quantity | Value | Units | Method | Reference | Comment |
---|---|---|---|---|---|
ΔrH° | 18.8 ± 2.0 | kcal/mol | TDAs | Grimsrud, Chowdhury, et al., 1986 | gas phase; B,M |
Quantity | Value | Units | Method | Reference | Comment |
ΔrS° | 21.5 | cal/mol*K | PHPMS | Grimsrud, Chowdhury, et al., 1986 | gas phase; M |
Quantity | Value | Units | Method | Reference | Comment |
ΔrG° | 12.4 ± 2.0 | kcal/mol | TDAs | Grimsrud, Chowdhury, et al., 1986 | gas phase; B |
By formula: NO2- + C7H7NO3 = (NO2- • C7H7NO3)
Quantity | Value | Units | Method | Reference | Comment |
---|---|---|---|---|---|
ΔrH° | 20.5 ± 2.0 | kcal/mol | TDAs | Grimsrud, Chowdhury, et al., 1986 | gas phase; B |
Quantity | Value | Units | Method | Reference | Comment |
ΔrG° | 12.6 ± 2.0 | kcal/mol | TDAs | Grimsrud, Chowdhury, et al., 1986 | gas phase; B |
By formula: NO2- + C7H7NO3 = (NO2- • C7H7NO3)
Quantity | Value | Units | Method | Reference | Comment |
---|---|---|---|---|---|
ΔrH° | 20.5 | kcal/mol | PHPMS | Grimsrud, Chowdhury, et al., 1986 | gas phase; M |
Quantity | Value | Units | Method | Reference | Comment |
ΔrS° | 26.3 | cal/mol*K | PHPMS | Grimsrud, Chowdhury, et al., 1986 | gas phase; M |
By formula: NO2- + HNO2 = (NO2- • HNO2)
Quantity | Value | Units | Method | Reference | Comment |
---|---|---|---|---|---|
ΔrH° | 32.5 ± 1.0 | kcal/mol | TDAs | Lee, Keesee, et al., 1980 | gas phase; B |
By formula: NO2- + H2O = (NO2- • H2O)
Bond type: Hydrogen bond (negative ion to hydride)
Quantity | Value | Units | Method | Reference | Comment |
---|---|---|---|---|---|
ΔrH° | 16. ± 4. | kcal/mol | AVG | N/A | Average of 6 values; Individual data points |
Quantity | Value | Units | Method | Reference | Comment |
ΔrS° | 20.3 | cal/mol*K | PHPMS | Sieck, 1985 | gas phase; M |
ΔrS° | 20.0 | cal/mol*K | FA | Bohringer, Fahey, et al., 1984 | gas phase; switching reaction(NO2-)H2O; Lee, Keesee, et al., 1980; M |
ΔrS° | 23.8 | cal/mol*K | HPMS | Lee, Keesee, et al., 1980 | gas phase; M |
ΔrS° | 21. | cal/mol*K | HPMS | Payzant, Yamdagni, et al., 1971 | gas phase; M |
Quantity | Value | Units | Method | Reference | Comment |
ΔrG° | 8.50 ± 0.20 | kcal/mol | TDAs | Sieck, 1985 | gas phase; B |
ΔrG° | 8.50 ± 0.30 | kcal/mol | TDAs | Blades, Klassen, et al., 1995 | gas phase; T: 293 K. ΔSaff approx. 24 cal/mol-K; B,M |
ΔrG° | 8.1 ± 5.8 | kcal/mol | Endo | Paulson and Dale, 1982 | gas phase; B |
ΔrG° | 8.10 ± 0.20 | kcal/mol | TDAs | Lee, Keesee, et al., 1980 | gas phase; B |
ΔrG° | 8.00 | kcal/mol | TDAs | Payzant, Yamdagni, et al., 1971 | gas phase; B |
Free energy of reaction
ΔrG° (kcal/mol) | T (K) | Method | Reference | Comment |
---|---|---|---|---|
8.0 | 296. | FA | Fehsenfeld and Ferguson, 1974 | gas phase; M |
8.4 | 300. | SAMS | Payzant, Cunningham, et al., 1972 | gas phase; M |
By formula: (NO2- • H2O) + H2O = (NO2- • 2H2O)
Bond type: Hydrogen bond (negative ion to hydride)
Quantity | Value | Units | Method | Reference | Comment |
---|---|---|---|---|---|
ΔrH° | 13.0 ± 1.5 | kcal/mol | TDAs | Blades, Klassen, et al., 1995 | gas phase; T: 293 K. ΔSaff approx. 24 cal/mol-K; B |
ΔrH° | 12.9 ± 1.0 | kcal/mol | TDAs | Payzant, Yamdagni, et al., 1971 | gas phase; B,M |
ΔrH° | 12.9 ± 1.0 | kcal/mol | TDAs | Arshadi, Yamdagni, et al., 1970 | gas phase; B |
ΔrH° | 13.6 | kcal/mol | HPMS | Lee, Keesee, et al., 1980 | gas phase; M |
Quantity | Value | Units | Method | Reference | Comment |
ΔrS° | 26.4 | cal/mol*K | HPMS | Lee, Keesee, et al., 1980 | gas phase; M |
ΔrS° | 23.7 | cal/mol*K | HPMS | Payzant, Yamdagni, et al., 1971 | gas phase; M |
Quantity | Value | Units | Method | Reference | Comment |
ΔrG° | 6.00 ± 0.30 | kcal/mol | TDAs | Blades, Klassen, et al., 1995 | gas phase; T: 293 K. ΔSaff approx. 24 cal/mol-K; B,M |
ΔrG° | 5.8 ± 1.4 | kcal/mol | TDAs | Payzant, Yamdagni, et al., 1971 | gas phase; B |
ΔrG° | 5.80 | kcal/mol | TDAs | Arshadi, Yamdagni, et al., 1970 | gas phase; B |
ΔrG° | 6.1 ± 2.0 | kcal/mol | TDAs | Kebarle, Arshadi, et al., 1968 | gas phase; B,M |
Free energy of reaction
ΔrG° (kcal/mol) | T (K) | Method | Reference | Comment |
---|---|---|---|---|
5.9 | 296. | FA | Fehsenfeld and Ferguson, 1974 | gas phase; M |
5.8 | 300. | SAMS | Payzant, Cunningham, et al., 1972 | gas phase; M |
By formula: (NO2- • 2H2O) + H2O = (NO2- • 3H2O)
Bond type: Hydrogen bond (negative ion to hydride)
Quantity | Value | Units | Method | Reference | Comment |
---|---|---|---|---|---|
ΔrH° | 11.5 ± 1.5 | kcal/mol | TDAs | Blades, Klassen, et al., 1995 | gas phase; T: 293 K. ΔSaff approx. 24 cal/mol-K; B |
ΔrH° | 10.4 ± 1.0 | kcal/mol | TDAs | Payzant, Yamdagni, et al., 1971 | gas phase; B,M |
ΔrH° | 10.4 ± 1.0 | kcal/mol | TDAs | Arshadi, Yamdagni, et al., 1970 | gas phase; B |
ΔrH° | 11.7 | kcal/mol | HPMS | Lee, Keesee, et al., 1980 | gas phase; M |
Quantity | Value | Units | Method | Reference | Comment |
ΔrS° | 25.8 | cal/mol*K | HPMS | Lee, Keesee, et al., 1980 | gas phase; M |
ΔrS° | 21.2 | cal/mol*K | HPMS | Payzant, Yamdagni, et al., 1971 | gas phase; M |
Quantity | Value | Units | Method | Reference | Comment |
ΔrG° | 4.50 ± 0.30 | kcal/mol | TDAs | Blades, Klassen, et al., 1995 | gas phase; T: 293 K. ΔSaff approx. 24 cal/mol-K; B,M |
ΔrG° | 4.0 ± 1.4 | kcal/mol | TDAs | Payzant, Yamdagni, et al., 1971 | gas phase; B |
ΔrG° | 4.10 | kcal/mol | TDAs | Arshadi, Yamdagni, et al., 1970 | gas phase; B |
ΔrG° | 4.5 ± 2.0 | kcal/mol | TDAs | Kebarle, Arshadi, et al., 1968 | gas phase; B,M |
By formula: (NO2- • 3H2O) + H2O = (NO2- • 4H2O)
Quantity | Value | Units | Method | Reference | Comment |
---|---|---|---|---|---|
ΔrH° | 11.6 | kcal/mol | HPMS | Lee, Keesee, et al., 1980 | gas phase; M |
Quantity | Value | Units | Method | Reference | Comment |
ΔrS° | 29.0 | cal/mol*K | HPMS | Lee, Keesee, et al., 1980 | gas phase; M |
By formula: NO2- + H2O2 = (NO2- • H2O2)
Quantity | Value | Units | Method | Reference | Comment |
---|---|---|---|---|---|
ΔrH° | 20.2 ± 1.0 | kcal/mol | TDEq | Bohringer, Fahey, et al., 1984 | gas phase; Relative to HOH..NO2-, Keesee, Lee, et al., 1980; B |
Quantity | Value | Units | Method | Reference | Comment |
ΔrG° | 14.3 ± 1.0 | kcal/mol | TDEq | Bohringer, Fahey, et al., 1984 | gas phase; Relative to HOH..NO2-, Keesee, Lee, et al., 1980; B |
By formula: NO2- + H2Se = (NO2- • H2Se)
Quantity | Value | Units | Method | Reference | Comment |
---|---|---|---|---|---|
ΔrH° | 20.9 ± 1.0 | kcal/mol | TDEq | Wlodek, Luczynski, et al., 1983, 2 | gas phase; Equilibration with SO2..NO2-; B |
Quantity | Value | Units | Method | Reference | Comment |
ΔrG° | 10.3 ± 3.5 | kcal/mol | TDEq | Wlodek, Luczynski, et al., 1983, 2 | gas phase; Equilibration with SO2..NO2-; B |
By formula: (NO2- • H2Se) + H2Se = (NO2- • 2H2Se)
Quantity | Value | Units | Method | Reference | Comment |
---|---|---|---|---|---|
ΔrH° | 8.50 ± 0.50 | kcal/mol | TDAs | Wlodek, Luczynski, et al., 1983, 2 | gas phase; B |
Quantity | Value | Units | Method | Reference | Comment |
ΔrG° | 4.70 ± 0.30 | kcal/mol | TDAs | Wlodek, Luczynski, et al., 1983, 2 | gas phase; B |
By formula: (NO2- • 2H2Se) + H2Se = (NO2- • 3H2Se)
Quantity | Value | Units | Method | Reference | Comment |
---|---|---|---|---|---|
ΔrH° | 7.30 ± 0.70 | kcal/mol | TDAs | Wlodek, Luczynski, et al., 1983, 2 | gas phase; B |
Quantity | Value | Units | Method | Reference | Comment |
ΔrG° | 3.10 ± 0.50 | kcal/mol | TDAs | Wlodek, Luczynski, et al., 1983, 2 | gas phase; B |
By formula: (NO2- • 4294967295NO2) + NO2 = NO2-
Quantity | Value | Units | Method | Reference | Comment |
---|---|---|---|---|---|
ΔrH° | 107.31 ± 0.30 | kcal/mol | N/A | Davidson, Fehsenfeld, et al., 1977 | gas phase; Relative to HBr, reevaluated with current HBr acidity. Excited state at 3.0 eV,81WU /TIE.; B |
ΔrH° | <46.10 | kcal/mol | PDis | Smith, Lee, et al., 1979 | gas phase; Isomer: O4- + NO ->.; B |
ΔrH° | 66.0 ± 5.0 | kcal/mol | PDis | Smith, Lee, et al., 1978 | gas phase; B |
By formula: NO2- + O2S = (NO2- • O2S)
Quantity | Value | Units | Method | Reference | Comment |
---|---|---|---|---|---|
ΔrH° | 25.90 ± 0.20 | kcal/mol | TDAs | Keesee, Lee, et al., 1980 | gas phase; B,M |
ΔrH° | 24.3 ± 1.0 | kcal/mol | TDEq | Bohringer, Fahey, et al., 1984 | gas phase; Relative to HOH..NO2-, Keesee, Lee, et al., 1980; B,M |
Quantity | Value | Units | Method | Reference | Comment |
ΔrS° | 36.8 | cal/mol*K | HPMS | Keesee, Lee, et al., 1980 | gas phase; M |
ΔrS° | 31.6 | cal/mol*K | N/A | Bohringer, Fahey, et al., 1984 | gas phase; switching reaction(NO2-)H2O, Entropy change calculated or estimated; Lee, Keesee, et al., 1980; M |
Quantity | Value | Units | Method | Reference | Comment |
ΔrG° | 14.90 ± 0.30 | kcal/mol | TDAs | Keesee, Lee, et al., 1980 | gas phase; B |
By formula: (NO2- • O2S) + C2H5NO3 = (NO2- • C2H5NO3 • O2S)
Quantity | Value | Units | Method | Reference | Comment |
---|---|---|---|---|---|
ΔrH° | 7.4 | kcal/mol | HPMS | Wlodek, Luczynski, et al., 1983 | gas phase; Entropy change is questionable; M |
Quantity | Value | Units | Method | Reference | Comment |
ΔrS° | 10.4 | cal/mol*K | HPMS | Wlodek, Luczynski, et al., 1983 | gas phase; Entropy change is questionable; M |
By formula: (NO2- • O2S) + O2S = (NO2- • 2O2S)
Quantity | Value | Units | Method | Reference | Comment |
---|---|---|---|---|---|
ΔrH° | 9.00 ± 0.20 | kcal/mol | TDAs | Keesee, Lee, et al., 1980 | gas phase; B,M |
ΔrH° | 9.8 | kcal/mol | HPMS | Wlodek, Luczynski, et al., 1983 | gas phase; M |
Quantity | Value | Units | Method | Reference | Comment |
ΔrS° | 21.5 | cal/mol*K | HPMS | Wlodek, Luczynski, et al., 1983 | gas phase; M |
ΔrS° | 16.8 | cal/mol*K | HPMS | Keesee, Lee, et al., 1980 | gas phase; M |
Quantity | Value | Units | Method | Reference | Comment |
ΔrG° | 4.00 ± 0.40 | kcal/mol | TDAs | Keesee, Lee, et al., 1980 | gas phase; B |
By formula: (NO2- • 2O2S) + O2S = (NO2- • 3O2S)
Quantity | Value | Units | Method | Reference | Comment |
---|---|---|---|---|---|
ΔrH° | 6.60 ± 0.20 | kcal/mol | TDAs | Keesee, Lee, et al., 1980 | gas phase; B,M |
Quantity | Value | Units | Method | Reference | Comment |
ΔrS° | 13.4 | cal/mol*K | HPMS | Keesee, Lee, et al., 1980 | gas phase; Entropy change is questionable; M |
Quantity | Value | Units | Method | Reference | Comment |
ΔrG° | 2.60 ± 0.80 | kcal/mol | TDAs | Keesee, Lee, et al., 1980 | gas phase; B |

References

Chase, 1998
Chase, M.W., Jr.,
NIST-JANAF Themochemical Tables, Fourth Edition,
J. Phys. Chem. Ref. Data, Monograph 9, 1998, 1-1951. [all data]
Sieck, 1985
Sieck, L.W.,
Thermochemistry of Solvation of NO2- and C6H5NO2- by Polar Molecules in the Vapor Phase. Comparison with Cl- and Variation with Ligand Structure.,
J. Phys. Chem., 1985, 89, 25, 5552, https://doi.org/10.1021/j100271a049
. [all data]
Bohringer, Fahey, et al., 1984
Bohringer, H.; Fahey, D.W.; Fehsenfeld, F.C.; Ferguson, E.E.,
Bond energies of the molecules H2O, SO2, H2O2, and HCl to various atmospheric negative ions,
J. Chem. Phys., 1984, 81, 2805. [all data]
Lee, Keesee, et al., 1980
Lee, N.; Keesee, R.G.; Castleman, A.W., Jr.,
The properties of clusters in the gas phase. IV. Complexes of H2O and HNOx clustering on NOx-,
J. Chem. Phys., 1980, 72, 1089. [all data]
Payzant, Yamdagni, et al., 1971
Payzant, J.D.; Yamdagni, R.; Kebarle, P.,
Hydration of CN-, NO2-, NO3-, and HO- in the gas phase,
Can. J. Chem., 1971, 49, 3308. [all data]
Blades, Klassen, et al., 1995
Blades, A.T.; Klassen, J.S.; Kebarle, P.,
Free Energies of Hydration in the Gas Phase on the Anions of Some Oxo Acids of C, N, S, P, Cl and I,
J. Am. Chem. Soc., 1995, 117, 42, 10563, https://doi.org/10.1021/ja00147a019
. [all data]
Paulson and Dale, 1982
Paulson, J.F.; Dale, J.,
Reactions of OH-.H2O with NO2,
J. Chem. Phys., 1982, 77, 4006. [all data]
Fehsenfeld and Ferguson, 1974
Fehsenfeld, F.C.; Ferguson, E.E.,
Laboratory studies of negative ion reactions with atmospheric trace constituents,
J. Chem. Phys., 1974, 61, 3181. [all data]
Payzant, Cunningham, et al., 1972
Payzant, J.D.; Cunningham, A.J.; Kebarle, P.,
Kinetics and Rate Constants of Reactions Leading to Hydration of NO2- and NO3- in Gaseous Oxygen, Argon, and Helium Containing Traces of Water,
Can. J. Chem., 1972, 50, 14, 2230, https://doi.org/10.1139/v72-358
. [all data]
Arshadi, Yamdagni, et al., 1970
Arshadi, M.; Yamdagni, R.; Kebarle, P.,
Hydration of Halide Negative Ions in the Gas Phase. II. Comparison of Hydration Energies for the Alkali Positive and Halide Negative Ions,
J. Phys. Chem., 1970, 74, 7, 1475, https://doi.org/10.1021/j100702a014
. [all data]
Kebarle, Arshadi, et al., 1968
Kebarle, P.; Arshadi, M.; Scarborough, J.,
Hydration of Negative Ions in the Gas Phase,
J. Chem. Phys., 1968, 49, 2, 817, https://doi.org/10.1063/1.1670145
. [all data]
Keesee, Lee, et al., 1980
Keesee, R.G.; Lee, N.; Castleman, A.W., Jr.,
Properties of clusters in the gas phase: V. Complexes of neutral molecules onto negative ions,
J. Chem. Phys., 1980, 73, 2195. [all data]
Hiraoka and Yamabe, 1992
Hiraoka, K.; Yamabe, S.,
Formation of the Chelate Bonds in the Cluster O2(-)(CO2)n, CO3(-)(CO2)n, and NO2(-)(CO2)n,
J. Chem. Phys., 1992, 97, 1, 643, https://doi.org/10.1063/1.463560
. [all data]
Wlodek, Luczynski, et al., 1983
Wlodek, S.; Luczynski, Z.; Wincel, H.,
Gas phase complexes of NO2- and NO3- with SO2,
Int. J. Mass Spectrom. Ion Processes, 1983, 49, 301. [all data]
Wincel, 2003
Wincel, H.,
Gas-phase Solvation of Cl-, NO2-, CH2NO2-, CH3NO2-, and CH3NO4- by CH3NO2,
Int. J. Mass Spectrom., 2003, 226, 3, 341-353, https://doi.org/10.1016/S1387-3806(03)00066-6
. [all data]
Davidson, Fehsenfeld, et al., 1977
Davidson, J.A.; Fehsenfeld, F.C.; Howard, C.J.,
The heats of formation of NO3- and NO3- association complexes with HNO3 and HBr,
Int. J. Chem. Kinet., 1977, 9, 17. [all data]
Smith, Lee, et al., 1979
Smith, G.P.; Lee, L.C.; Moseley, J.T.,
Photodissociation and photodetachment of molecular negative ions. VIII. Nitrogen oxides and hydrates,3500-8250 Å,
J. Chem. Phys., 1979, 71, 4034. [all data]
Smith, Lee, et al., 1978
Smith, G.P.; Lee, L.C.; Cosby, P.C.; Peterson, J.R.; Moseley, J.T.,
Photodissociation and photodetachment of molecular negative ions. V. Atmospheric ions from 7000 to 8400 A),
J. Chem. Phys., 1978, 68, 3818. [all data]
Wlodek, Luczynski, et al., 1983, 2
Wlodek, S.; Luczynski, Z.; Wincel, H.,
Gas - Phase Solvation of NO2- and NO3- by Ethyl Nitrate,
Int. J. Mass Spectrom. Ion Phys., 1983, 52, 2-3, 149, https://doi.org/10.1016/0020-7381(83)85036-0
. [all data]
Grimsrud, Chowdhury, et al., 1986
Grimsrud, E.P.; Chowdhury, S.; Kebarle, P.,
Gas Phase Reactions of NO2- with Nitrobenzenes and Quinones. Electron Transfer, Clusters, and Formation of Phenoxide and Quinoxide Negative Ions. Use of NO2 as a NICI Reagent Gas.,
Int. J. Mass Spectrom. Ion Proc., 1986, 68, 1-2, 57, https://doi.org/10.1016/0168-1176(86)87068-9
. [all data]
Ervin, Ho, et al., 1988
Ervin, K.M.; Ho, J.; Lineberger, W.C.,
Ultraviolet Photoelectron Spectrum of NO2-,
J. Phys. Chem., 1988, 92, 19, 5405, https://doi.org/10.1021/j100330a017
. [all data]
Wincel, 2004
Wincel, H.,
Gas-phase clustering reactions of NO2-, C2H3NO2-, C2H4NO2-C2H5NO2- and C2H5NO4- with C2H5NO2,
Int. J. Mass Spectrom., 2004, 232, 2, 185-194, https://doi.org/10.1016/j.ijms.2004.01.003
. [all data]
Viidanoja, Reiner, et al., 2000
Viidanoja, J.; Reiner, T.; Kiendler, A.; Grimm, F.; Arnold, F.,
Laboratory investigations of negative ion molecule reactions of propionic, butyric, glyoxylic, pyruvic, and pinonic acids,
Int. J. Mass Spectrom., 2000, 194, 1, 53-68, https://doi.org/10.1016/S1387-3806(99)00172-4
. [all data]
Viidanoja, Reiner, et al., 1998
Viidanoja, J.; Reiner, T.; Arnold, F.,
Laboratory Investigations of Negative Ion-Molecule Reactions of Formic and Acetic Acid.,
Int. J. Mass Spectrom., 1998, 181, 1-3, 31, https://doi.org/10.1016/S1387-3806(98)14151-9
. [all data]