Neon cation
- Formula: Ne+
- Molecular weight: 20.1792
- CAS Registry Number: 14782-23-1

Gas phase thermochemistry data

Quantity | Value | Units | Method | Reference | Comment |
---|---|---|---|---|---|
S°gas,1 bar | 37.835 | cal/mol*K | Review | Chase, 1998 | Data last reviewed in March, 1982 |

Reaction thermochemistry data

Data compiled by: Michael M. Meot-Ner (Mautner) and Sharon G. Lias
Individual Reactions
By formula: (Ne+ • 2Ne) + Ne = (Ne+ • 3Ne)
Quantity | Value | Units | Method | Reference | Comment |
---|---|---|---|---|---|
ΔrH° | 2.47 ± 0.15 | kcal/mol | PHPMS | Hiraoka and Mori, 1990 | gas phase |
Quantity | Value | Units | Method | Reference | Comment |
ΔrS° | 18.7 | cal/mol*K | PHPMS | Hiraoka and Mori, 1990 | gas phase |
By formula: (Ne+ • 3Ne) + Ne = (Ne+ • 4Ne)
Quantity | Value | Units | Method | Reference | Comment |
---|---|---|---|---|---|
ΔrH° | 0.79 ± 0.15 | kcal/mol | PHPMS | Hiraoka and Mori, 1990 | gas phase |
Quantity | Value | Units | Method | Reference | Comment |
ΔrS° | 12.7 | cal/mol*K | PHPMS | Hiraoka and Mori, 1990 | gas phase |
By formula: (Ne+ • 4Ne) + Ne = (Ne+ • 5Ne)
Quantity | Value | Units | Method | Reference | Comment |
---|---|---|---|---|---|
ΔrH° | 0.77 ± 0.15 | kcal/mol | PHPMS | Hiraoka and Mori, 1990 | gas phase |
Quantity | Value | Units | Method | Reference | Comment |
ΔrS° | 13.4 | cal/mol*K | PHPMS | Hiraoka and Mori, 1990 | gas phase |
By formula: (Ne+ • 5Ne) + Ne = (Ne+ • 6Ne)
Quantity | Value | Units | Method | Reference | Comment |
---|---|---|---|---|---|
ΔrH° | 0.76 ± 0.15 | kcal/mol | PHPMS | Hiraoka and Mori, 1990 | gas phase |
Quantity | Value | Units | Method | Reference | Comment |
ΔrS° | 13.8 | cal/mol*K | PHPMS | Hiraoka and Mori, 1990 | gas phase |
By formula: (Ne+ • 6Ne) + Ne = (Ne+ • 7Ne)
Quantity | Value | Units | Method | Reference | Comment |
---|---|---|---|---|---|
ΔrH° | 0.72 ± 0.15 | kcal/mol | PHPMS | Hiraoka and Mori, 1990 | gas phase |
Quantity | Value | Units | Method | Reference | Comment |
ΔrS° | 14.2 | cal/mol*K | PHPMS | Hiraoka and Mori, 1990 | gas phase |
By formula: (Ne+ • 7Ne) + Ne = (Ne+ • 8Ne)
Quantity | Value | Units | Method | Reference | Comment |
---|---|---|---|---|---|
ΔrH° | 0.67 ± 0.15 | kcal/mol | PHPMS | Hiraoka and Mori, 1990 | gas phase |
Quantity | Value | Units | Method | Reference | Comment |
ΔrS° | 14.9 | cal/mol*K | PHPMS | Hiraoka and Mori, 1990 | gas phase |
By formula: (Ne+ • 8Ne) + Ne = (Ne+ • 9Ne)
Quantity | Value | Units | Method | Reference | Comment |
---|---|---|---|---|---|
ΔrH° | 0.62 ± 0.15 | kcal/mol | PHPMS | Hiraoka and Mori, 1990 | gas phase |
Quantity | Value | Units | Method | Reference | Comment |
ΔrS° | 15.3 | cal/mol*K | PHPMS | Hiraoka and Mori, 1990 | gas phase |
By formula: Ne+ + Ne = (Ne+ • Ne)
Quantity | Value | Units | Method | Reference | Comment |
---|---|---|---|---|---|
ΔrH° | 31.4 | kcal/mol | PI | Dehmer and Pratt, 1982 | gas phase |
ΔrH° | 30.0 | kcal/mol | SCATTERING | Mittman and Weise, 1974 | gas phase |
By formula: Ne+ + He = (Ne+ • He)
Quantity | Value | Units | Method | Reference | Comment |
---|---|---|---|---|---|
ΔrH° | 16.0 | kcal/mol | EmSpec | Dehmer and Pratt, 1982 | gas phase |

Ion clustering data

Data compiled by: Michael M. Meot-Ner (Mautner) and Sharon G. Lias
Clustering reactions
By formula: Ne+ + He = (Ne+ • He)
Quantity | Value | Units | Method | Reference | Comment |
---|---|---|---|---|---|
ΔrH° | 16.0 | kcal/mol | EmSpec | Dehmer and Pratt, 1982 | gas phase |
By formula: Ne+ + Ne = (Ne+ • Ne)
Quantity | Value | Units | Method | Reference | Comment |
---|---|---|---|---|---|
ΔrH° | 31.4 | kcal/mol | PI | Dehmer and Pratt, 1982 | gas phase |
ΔrH° | 30.0 | kcal/mol | SCATTERING | Mittman and Weise, 1974 | gas phase |
By formula: (Ne+ • 2Ne) + Ne = (Ne+ • 3Ne)
Quantity | Value | Units | Method | Reference | Comment |
---|---|---|---|---|---|
ΔrH° | 2.47 ± 0.15 | kcal/mol | PHPMS | Hiraoka and Mori, 1990 | gas phase |
Quantity | Value | Units | Method | Reference | Comment |
ΔrS° | 18.7 | cal/mol*K | PHPMS | Hiraoka and Mori, 1990 | gas phase |
By formula: (Ne+ • 3Ne) + Ne = (Ne+ • 4Ne)
Quantity | Value | Units | Method | Reference | Comment |
---|---|---|---|---|---|
ΔrH° | 0.79 ± 0.15 | kcal/mol | PHPMS | Hiraoka and Mori, 1990 | gas phase |
Quantity | Value | Units | Method | Reference | Comment |
ΔrS° | 12.7 | cal/mol*K | PHPMS | Hiraoka and Mori, 1990 | gas phase |
By formula: (Ne+ • 4Ne) + Ne = (Ne+ • 5Ne)
Quantity | Value | Units | Method | Reference | Comment |
---|---|---|---|---|---|
ΔrH° | 0.77 ± 0.15 | kcal/mol | PHPMS | Hiraoka and Mori, 1990 | gas phase |
Quantity | Value | Units | Method | Reference | Comment |
ΔrS° | 13.4 | cal/mol*K | PHPMS | Hiraoka and Mori, 1990 | gas phase |
By formula: (Ne+ • 5Ne) + Ne = (Ne+ • 6Ne)
Quantity | Value | Units | Method | Reference | Comment |
---|---|---|---|---|---|
ΔrH° | 0.76 ± 0.15 | kcal/mol | PHPMS | Hiraoka and Mori, 1990 | gas phase |
Quantity | Value | Units | Method | Reference | Comment |
ΔrS° | 13.8 | cal/mol*K | PHPMS | Hiraoka and Mori, 1990 | gas phase |
By formula: (Ne+ • 6Ne) + Ne = (Ne+ • 7Ne)
Quantity | Value | Units | Method | Reference | Comment |
---|---|---|---|---|---|
ΔrH° | 0.72 ± 0.15 | kcal/mol | PHPMS | Hiraoka and Mori, 1990 | gas phase |
Quantity | Value | Units | Method | Reference | Comment |
ΔrS° | 14.2 | cal/mol*K | PHPMS | Hiraoka and Mori, 1990 | gas phase |
By formula: (Ne+ • 7Ne) + Ne = (Ne+ • 8Ne)
Quantity | Value | Units | Method | Reference | Comment |
---|---|---|---|---|---|
ΔrH° | 0.67 ± 0.15 | kcal/mol | PHPMS | Hiraoka and Mori, 1990 | gas phase |
Quantity | Value | Units | Method | Reference | Comment |
ΔrS° | 14.9 | cal/mol*K | PHPMS | Hiraoka and Mori, 1990 | gas phase |
By formula: (Ne+ • 8Ne) + Ne = (Ne+ • 9Ne)
Quantity | Value | Units | Method | Reference | Comment |
---|---|---|---|---|---|
ΔrH° | 0.62 ± 0.15 | kcal/mol | PHPMS | Hiraoka and Mori, 1990 | gas phase |
Quantity | Value | Units | Method | Reference | Comment |
ΔrS° | 15.3 | cal/mol*K | PHPMS | Hiraoka and Mori, 1990 | gas phase |

References

Chase, 1998
Chase, M.W., Jr.,
NIST-JANAF Themochemical Tables, Fourth Edition,
J. Phys. Chem. Ref. Data, Monograph 9, 1998, 1-1951. [all data]
Hiraoka and Mori, 1990
Hiraoka, K.; Mori, T.,
Stability of Rare - Gas Cluster Ions,
J. Chem. Phys., 1990, 92, 7, 4408, https://doi.org/10.1063/1.457751
. [all data]
Dehmer and Pratt, 1982
Dehmer, P.M.; Pratt, S.T.,
Photoionization of ArKr, ArXe, and KrXe and bond dissociation energies of the rare gas dimer ions,
J. Chem. Phys., 1982, 77, 4804. [all data]
Mittman and Weise, 1974
Mittman, H.U.; Weise, H.P.,
Scattering of Ions V. Elastic Scattering of the Symmetric Rare Gas Ion - Rare Gas Atom Systems,
Z. Naturforsch., 1974, A29, 400. [all data]