1,3-Benzenedimethanamine
- Formula: C8H12N2
- Molecular weight: 136.1943
- IUPAC Standard InChIKey: FDLQZKYLHJJBHD-UHFFFAOYSA-N
- CAS Registry Number: 1477-55-0
- Chemical structure:
View 3d structure (requires JavaScript / HTML 5) - Other names: m-Xylene-α,α'-diamine; α,α'-m-Xylenediamine; α,α'-Diamino-m-xylene; m-Xylylenediamine; 1,3-Bis(aminomethyl)benzene; 1,3-Xylylenediamine; m-Phenylenebis(methylamine); m-Xylylendiamin; Methylamine, m-phenylenebis-; MXDA; 1,3-Bis-aminomethylbenzen; NSC 61568; Epilink MX

Phase change data

Data compiled by: Robert L. Brown and Stephen E. Stein
Quantity | Value | Units | Method | Reference | Comment |
---|---|---|---|---|---|
Tboil | 520.2 | K | N/A | Weast and Grasselli, 1989 | |
Tboil | 518. to 521. | K | N/A | Buckingham and Donaghy, 1982 |
Reduced pressure boiling point
Tboil (K) | Pressure (bar) | Reference |
---|---|---|
538.2 | 0.993 | Aldrich Chemical Company Inc., 1990 |
413. | 0.019 | Buckingham and Donaghy, 1982 |

Van Den Dool and Kratz RI, non-polar column, temperature ramp

Column type | Active phase | I | Reference | Comment |
---|---|---|---|---|
Capillary | OV-1 | 1328.2 | Gautzsch and Zinn, 1996 | 8. K/min; Tstart: 35. C; Tend: 300. C |

References

Weast and Grasselli, 1989
CRC Handbook of Data on Organic Compounds, 2nd Editon, Weast,R.C and Grasselli, J.G., ed(s)., CRC Press, Inc., Boca Raton, FL, 1989, 1. [all data]
Buckingham and Donaghy, 1982
Buckingham, J.; Donaghy, S.M.,
Dictionary of Organic Compounds: Fifth Edition, Chapman and Hall, New York, 1982, 1. [all data]
Aldrich Chemical Company Inc., 1990
Aldrich Chemical Company Inc.,
Catalog Handbook of Fine Chemicals, Aldrich Chemical Company, Inc., Milwaukee WI, 1990, 1. [all data]
Gautzsch and Zinn, 1996
Gautzsch, R.; Zinn, P.,
Use of incremental models to estimate the retention indexes of aromatic compounds,
Chromatographia, 1996, 43, 3/4, 163-176, https://doi.org/10.1007/BF02292946
. [all data]