2-Butene, 1,4-dichloro-, (Z)-
- Formula: C4H6Cl2
- Molecular weight: 124.996
- IUPAC Standard InChIKey: FQDIANVAWVHZIR-UPHRSURJSA-N
- CAS Registry Number: 1476-11-5
- Chemical structure:
View 3d structure (requires JavaScript / HTML 5) - Species with the same structure:
- Stereoisomers:
- Other names: cis-1,4-dichlorobut-2-ene

Phase change data

Data compiled as indicated in comments:
BS - Robert L. Brown and Stephen E. Stein
TRC - Thermodynamics Research Center, NIST Boulder Laboratories, Chris Muzny director
Quantity | Value | Units | Method | Reference | Comment |
---|---|---|---|---|---|
Tboil | 425.7 | K | N/A | Weast and Grasselli, 1989 | BS |
Quantity | Value | Units | Method | Reference | Comment |
Tfus | 231.2 | K | N/A | Anonymous, 1968 | Uncertainty assigned by TRC = 2. K; source of data not stated; TRC |
Reduced pressure boiling point
Tboil (K) | Pressure (bar) | Reference | Comment |
---|---|---|---|
425.2 | 1.01 | Aldrich Chemical Company Inc., 1990 | BS |
295.7 | 0.004 | Weast and Grasselli, 1989 | BS |

Reaction thermochemistry data

Data compiled by: Hussein Y. Afeefy, Joel F. Liebman, and Stephen E. Stein
Individual Reactions
By formula: C4H6Cl2 = C4H6Cl2
Quantity | Value | Units | Method | Reference | Comment |
---|---|---|---|---|---|
ΔrH° | 1.67 | kJ/mol | Eqk | Zakharova, Gul'neva, et al., 1991 | gas phase; Heat of isomerization at 383 K |
By formula: C4H6Cl2 = C4H6Cl2
Quantity | Value | Units | Method | Reference | Comment |
---|---|---|---|---|---|
ΔrH° | -0.71 | kJ/mol | Eqk | Zakharova, Gul'neva, et al., 1991 | gas phase; Heat of isomerization at 383 K |
By formula: C4H6Cl2 = C4H6Cl2
Quantity | Value | Units | Method | Reference | Comment |
---|---|---|---|---|---|
ΔrH° | -4.2 | kJ/mol | Eqk | Levanova, Yanshevskaya, et al., 1986 | liquid phase; solvent: Naphtha |
By formula: C4H6Cl2 = C4H6Cl2
Quantity | Value | Units | Method | Reference | Comment |
---|---|---|---|---|---|
ΔrH° | 2. | kJ/mol | Eqk | Levanova, Yanshevskaya, et al., 1986 | liquid phase; solvent: Naphtha |

References

Weast and Grasselli, 1989
CRC Handbook of Data on Organic Compounds, 2nd Editon, Weast,R.C and Grasselli, J.G., ed(s)., CRC Press, Inc., Boca Raton, FL, 1989, 1. [all data]
Anonymous, 1968
Anonymous, R.,
Properties of hydrocarbon of high molecular weight, Am. Pet. Inst. Res. Proj. 42, Penn. State Univ., 1968. [all data]
Aldrich Chemical Company Inc., 1990
Aldrich Chemical Company Inc.,
Catalog Handbook of Fine Chemicals, Aldrich Chemical Company, Inc., Milwaukee WI, 1990, 1. [all data]
Zakharova, Gul'neva, et al., 1991
Zakharova, L.A.; Gul'neva, I.V.; Shestakov, G.K.; Temkin, O.N.; Levanova, S.V.; Martirosyan, G.T.; Malkhasyan, A.Ts.; Asatryan, E.M.,
Isomerization of dichlorobutenes,
Kinet. Catal., 1991, 32, 1190-1194, In original 1332. [all data]
Levanova, Yanshevskaya, et al., 1986
Levanova, S.V.; Yanshevskaya, I.V.; Asatryan, E.M.; Saakyan, N.L.; Kostand'yan, V.A.; Malkhasyan, A.Ts.; Martirosyan, G.T.,
Relationships of isomerization of the allylic type,
J. Appl. Chem. USSR, 1986, 59, 790-793. [all data]