2-Propenoic acid, 3-(3-hydroxyphenyl)-, (E)-
- Formula: C9H8O3
- Molecular weight: 164.1580
- IUPAC Standard InChIKey: KKSDGJDHHZEWEP-SNAWJCMRSA-N
- CAS Registry Number: 14755-02-3
- Chemical structure:
View 3d structure (requires JavaScript / HTML 5) - Species with the same structure:
- Other names: m-Hydroxycinnamic acid, trans; 2-Propenoic acid, 3-(3-hydroxyphenyl)-, (2E)-; m-Hydroxycinnamic acid; trans-3-Hydroxycinnamic acid

Condensed phase thermochemistry data

Data compiled by: Hussein Y. Afeefy, Joel F. Liebman, and Stephen E. Stein
Quantity | Value | Units | Method | Reference | Comment |
---|---|---|---|---|---|
ΔcH°solid | -4152.11 | kJ/mol | Ccb | Verkade, 1926 | Corresponding ΔfHºsolid = -532.80 kJ/mol (simple calculation by NIST; no Washburn corrections) |

References

Verkade, 1926
Verkade, P.E.,
Verbrandingswarmten van plaatsings-isomere benzol-derivaten en de theorie der geinduceerde alterneeren de polatiteit,
Verslag Akad. Wetenschappen Amsterdam, 1926, 35, 492-504. [all data]