Potassium tridecamer, positive ion
- Formula: K13+
- Molecular weight: 508.2774
- CAS Registry Number: 147545-99-1

Reaction thermochemistry data

Data compiled by: Michael M. Meot-Ner (Mautner) and Sharon G. Lias
Individual Reactions
By formula: K13+ + K2 = (K13+ • K2)
Quantity | Value | Units | Method | Reference | Comment |
---|---|---|---|---|---|
ΔrH° | 68.6 | kJ/mol | PDiss | Brechignac, Cahuzac, et al., 1990 | gas phase |

Ion clustering data

Data compiled by: Michael M. Meot-Ner (Mautner) and Sharon G. Lias
Clustering reactions
By formula: K13+ + K2 = (K13+ • K2)
Quantity | Value | Units | Method | Reference | Comment |
---|---|---|---|---|---|
ΔrH° | 68.6 | kJ/mol | PDiss | Brechignac, Cahuzac, et al., 1990 | gas phase |

References

Brechignac, Cahuzac, et al., 1990
Brechignac, C.; Cahuzac, P.; Carlier, F.; De Frutos, M.; Leyniger, J.,
Cohesive Energies of (K)n+ 5<n<200 from Photoevaporation Experiments,
J. Chem. Phys., 1990, 93, 10, 7449, https://doi.org/10.1063/1.459418
. [all data]