cis-2-Methoxycinnamic acid
- Formula: C10H10O3
- Molecular weight: 178.1846
- IUPAC Standard InChIKey: FEGVSPGUHMGGBO-SREVYHEPSA-N
- CAS Registry Number: 14737-91-8
- Chemical structure:
View 3d structure (requires JavaScript / HTML 5) - Stereoisomers:
- Other names: cis-o-Methoxycinnamic acid; 2-Propenoic acid, 3-(2-methoxyphenyl)-, (Z)-; Cinnamic acid, o-methoxy-, (Z)-; Acide ortho-methoxycinnamique; Substance H 36; (Z)-o-methoxycinnamic acid

Phase change data

Data compiled by: William E. Acree, Jr., James S. Chickos
Quantity | Value | Units | Method | Reference | Comment |
---|---|---|---|---|---|
ΔsubH° | 121.7 ± 0.6 | kJ/mol | ME | Monte and Hillesheim, 1999 | Based on data from 339. to 352. K. |

References

Monte and Hillesheim, 1999
Monte, Manuel J.S.; Hillesheim, Dorothea M.,
Vapour pressures, enthalpies and entropies of sublimation of trans -cinnamic acid and of nine methoxy and dimethoxycinnamic acids,
The Journal of Chemical Thermodynamics, 1999, 31, 11, 1443-1456, https://doi.org/10.1006/jcht.1999.0540
. [all data]