Diethyl octylmalonate
- Formula: C15H28O4
- Molecular weight: 272.3804
- IUPAC Standard InChIKey: YZYBVYGISZANLI-UHFFFAOYSA-N
- CAS Registry Number: 1472-85-1
- Chemical structure:
View 3d structure (requires JavaScript / HTML 5) - Other names: Malonic acid, octyl-, diethyl ester; Propanedioic acid, octyl-, diethyl ester

Normal alkane RI, non-polar column, custom temperature program

Column type | Active phase | I | Reference | Comment |
---|---|---|---|---|
Capillary | Methyl Silicone | 1703. | Zenkevich, 1999 | Program: not specified |

References

Zenkevich, 1999
Zenkevich, I.G.,
Mutual Correlation between Gas-Chromatographic Retention Indices of Organic Compounds from Different Series,
Zh. Anal. Khim., 1999, 54, 12, 1272-1279. [all data]