Dichlorofluoroborane
- Formula: BCl2F
- Molecular weight: 100.715
- IUPAC Standard InChIKey: RLMYPGCCNRBZOH-UHFFFAOYSA-N
- CAS Registry Number: 14720-31-1
- Chemical structure:
View 3d structure (requires JavaScript / HTML 5) - Permanent link for this species. Use this link for bookmarking this species for future reference.

Gas phase thermochemistry data

Quantity | Value | Units | Method | Reference | Comment |
---|---|---|---|---|---|
ΔfH°gas | -644.34 | kJ/mol | Review | Chase, 1998 | Data last reviewed in December, 1964 |
Quantity | Value | Units | Method | Reference | Comment |
S°gas,1 bar | 287.67 | J/mol*K | Review | Chase, 1998 | Data last reviewed in December, 1964 |
Gas Phase Heat Capacity (Shomate Equation)
Cp° = A + B*t + C*t2 + D*t3 +
E/t2
H° − H°298.15= A*t + B*t2/2 +
C*t3/3 + D*t4/4 − E/t + F − H
S° = A*ln(t) + B*t + C*t2/2 + D*t3/3 −
E/(2*t2) + G
Cp = heat capacity (J/mol*K)
H° = standard enthalpy (kJ/mol)
S° = standard entropy (J/mol*K)
t = temperature (K) / 1000.
View plot Requires a JavaScript / HTML 5 canvas capable browser.
Temperature (K) | 298. to 1000. | 1000. to 6000. |
---|---|---|
A | 39.59512 | 82.30137 |
B | 100.4365 | 0.486436 |
C | -91.22835 | -0.100975 |
D | 30.15221 | 0.007134 |
E | -0.282186 | -4.052836 |
F | -660.8084 | -680.1469 |
G | 307.8453 | 370.3936 |
H | -644.3360 | -644.3360 |
Reference | Chase, 1998 | Chase, 1998 |
Comment | Data last reviewed in December, 1964 | Data last reviewed in December, 1964 |

References

Chase, 1998
Chase, M.W., Jr.,
NIST-JANAF Themochemical Tables, Fourth Edition,
J. Phys. Chem. Ref. Data, Monograph 9, 1998, 1-1951. [all data]