(Z) 6-decenal

Phase change data

Data compiled by: William E. Acree, Jr., James S. Chickos

Quantity Value Units Method Reference Comment
Δvap59.3kJ/molCGCKoutek, Hoskovec, et al., 1996Based on data from 323. - 343. K. See also Ova, Koultek, et al., 2000.
Δvap59.5kJ/molCGCKoutek, Hoskovec, et al., 1996Based on data from 323. - 343. K. See also Ova, Koultek, et al., 2000.

References

Koutek, Hoskovec, et al., 1996
Koutek, Bohumir; Hoskovec, Michal; Vrkocov, Pavlína; Konecný, Karel; Feltl, Ladislav; Vrkoc, Jan, Gas chromatographic determination of vapour pressures of pheromone-like compounds III. Aldehydes, Journal of Chromatography A, 1996, 719, 2, 391-400, https://doi.org/10.1016/0021-9673(95)00740-7 . [all data]

Ova, Koultek, et al., 2000
Ova, P.V.; Koultek, B.; Hoskovec, M., Practice Oriented Results on Use and Production of Neem Ingredients and Pheromones VI, H. Kleeberg and C.P.W. Zebitz, ed(s)., Druck and Graphic, Giessen, 2000, 211-218. [all data]