1-Propene, 3-(1,1-dimethylethoxy)-
- Formula: C7H14O
- Molecular weight: 114.1855
- IUPAC Standard InChIKey: FHVRTMVXBVDWCK-UHFFFAOYSA-N
- CAS Registry Number: 1471-04-1
- Chemical structure:
View 3d structure (requires JavaScript / HTML 5) - Other names: Ether, allyl tert-butyl; tert-Butyl Allyl ether; Allyl tert-butyl ether; (CH3)3COCH2CH=CH2

Reaction thermochemistry data

Data compiled by: Hussein Y. Afeefy, Joel F. Liebman, and Stephen E. Stein
Individual Reactions
By formula: C7H14O = C7H14O
Quantity | Value | Units | Method | Reference | Comment |
---|---|---|---|---|---|
ΔrH° | -6.07 ± 0.29 | kcal/mol | Eqk | Taskinen, 1993 | liquid phase; solvent: DMSO; Isomerization |

References

Taskinen, 1993
Taskinen, E.,
Relative thermodynamic stabilities of isomeric alkyl allyl and alkyl (Z)-propenyl ethers,
Tetrahedron, 1993, 49, 11389-11394. [all data]