2-Octenoic acid
- Formula: C8H14O2
- Molecular weight: 142.1956
- IUPAC Standard InChIKey: CWMPPVPFLSZGCY-VOTSOKGWSA-N
- CAS Registry Number: 1470-50-4
- Chemical structure:
View 3d structure (requires JavaScript / HTML 5) - Species with the same structure:
- Stereoisomers:
- Other names: Oct-2-enoic acid

Phase change data

Data compiled by: Thermodynamics Research Center, NIST Boulder Laboratories, Chris Muzny director
Quantity | Value | Units | Method | Reference | Comment |
---|---|---|---|---|---|
Tboil | 518.15 | K | N/A | van Romburgh, 1938 | Uncertainty assigned by TRC = 2. K |

References

van Romburgh, 1938
van Romburgh, P.,
Recl. Trav. Chim. Pays-Bas, 1938, 57, 494. [all data]