Strontium ion (1+)
- Formula: Sr+
- Molecular weight: 87.62
- IUPAC Standard InChIKey: QDEYBKUQZKVQLI-UHFFFAOYSA-N
- CAS Registry Number: 14701-18-9
- Chemical structure:

Gas phase thermochemistry data

Quantity | Value | Units | Method | Reference | Comment |
---|---|---|---|---|---|
S°gas,1 bar | 170.40 | J/mol*K | Review | Chase, 1998 | Data last reviewed in September, 1983 |

Ion clustering data

Data compiled as indicated in comments:
RCD - Robert C. Dunbar
M - Michael M. Meot-Ner (Mautner) and Sharon G. Lias
Clustering reactions
By formula: Sr+ + C9H12 = (Sr+ • C9H12)
Quantity | Value | Units | Method | Reference | Comment |
---|---|---|---|---|---|
ΔrH° | 116. | kJ/mol | RAK | Gapeev and Dunbar, 2000 | RCD |
By formula: Sr+ + H2O = (Sr+ • H2O)
Quantity | Value | Units | Method | Reference | Comment |
---|---|---|---|---|---|
ΔrH° | 144. | kJ/mol | HPMS | Tang, Lian, et al., 1976 | gas phase; M |
Quantity | Value | Units | Method | Reference | Comment |
ΔrS° | 130. | J/mol*K | HPMS | Tang, Lian, et al., 1976 | gas phase; M |
By formula: (Sr+ • H2O) + H2O = (Sr+ • 2H2O)
Quantity | Value | Units | Method | Reference | Comment |
---|---|---|---|---|---|
ΔrH° | 128. | kJ/mol | HPMS | Tang, Lian, et al., 1976 | gas phase; M |
Quantity | Value | Units | Method | Reference | Comment |
ΔrS° | 118. | J/mol*K | HPMS | Tang, Lian, et al., 1976 | gas phase; M |
By formula: (Sr+ • 2H2O) + H2O = (Sr+ • 3H2O)
Quantity | Value | Units | Method | Reference | Comment |
---|---|---|---|---|---|
ΔrH° | 108. | kJ/mol | HPMS | Tang, Lian, et al., 1976 | gas phase; M |
Quantity | Value | Units | Method | Reference | Comment |
ΔrS° | 120. | J/mol*K | HPMS | Tang, Lian, et al., 1976 | gas phase; M |
By formula: (Sr+ • 3H2O) + H2O = (Sr+ • 4H2O)
Quantity | Value | Units | Method | Reference | Comment |
---|---|---|---|---|---|
ΔrH° | 93.3 | kJ/mol | HPMS | Tang, Lian, et al., 1976 | gas phase; M |
Quantity | Value | Units | Method | Reference | Comment |
ΔrS° | 118. | J/mol*K | HPMS | Tang, Lian, et al., 1976 | gas phase; M |
By formula: (Sr+ • 4H2O) + H2O = (Sr+ • 5H2O)
Quantity | Value | Units | Method | Reference | Comment |
---|---|---|---|---|---|
ΔrH° | 86.2 | kJ/mol | HPMS | Tang, Lian, et al., 1976 | gas phase; M |
Quantity | Value | Units | Method | Reference | Comment |
ΔrS° | 128. | J/mol*K | HPMS | Tang, Lian, et al., 1976 | gas phase; M |
By formula: (Sr+ • 5H2O) + H2O = (Sr+ • 6H2O)
Quantity | Value | Units | Method | Reference | Comment |
---|---|---|---|---|---|
ΔrH° | 76.6 | kJ/mol | HPMS | Tang, Lian, et al., 1976 | gas phase; M |
Quantity | Value | Units | Method | Reference | Comment |
ΔrS° | 128. | J/mol*K | HPMS | Tang, Lian, et al., 1976 | gas phase; M |
By formula: (Sr+ • 6H2O) + H2O = (Sr+ • 7H2O)
Quantity | Value | Units | Method | Reference | Comment |
---|---|---|---|---|---|
ΔrH° | 72.4 | kJ/mol | HPMS | Tang, Lian, et al., 1976 | gas phase; M |
Quantity | Value | Units | Method | Reference | Comment |
ΔrS° | 144. | J/mol*K | HPMS | Tang, Lian, et al., 1976 | gas phase; M |
By formula: (Sr+ • 7H2O) + H2O = (Sr+ • 8H2O)
Quantity | Value | Units | Method | Reference | Comment |
---|---|---|---|---|---|
ΔrH° | 68.6 | kJ/mol | HPMS | Tang, Lian, et al., 1976 | gas phase; M |
Quantity | Value | Units | Method | Reference | Comment |
ΔrS° | 157. | J/mol*K | HPMS | Tang, Lian, et al., 1976 | gas phase; M |

Reaction thermochemistry data

Data compiled as indicated in comments:
M - Michael M. Meot-Ner (Mautner) and Sharon G. Lias
RCD - Robert C. Dunbar

Individual Reactions

(Strontium ion (1+) • 2Water) + Water = (Strontium ion (1+) • 3Water)

By formula: (Sr+ • 2H2O) + H2O = (Sr+ • 3H2O)

Quantity Value Units Method Reference Comment
Δr108.kJ/molHPMSTang, Lian, et al., 1976gas phase; M
Quantity Value Units Method Reference Comment
Δr120.J/mol*KHPMSTang, Lian, et al., 1976gas phase; M

(Strontium ion (1+) • 3Water) + Water = (Strontium ion (1+) • 4Water)

By formula: (Sr+ • 3H2O) + H2O = (Sr+ • 4H2O)

Quantity Value Units Method Reference Comment
Δr93.3kJ/molHPMSTang, Lian, et al., 1976gas phase; M
Quantity Value Units Method Reference Comment
Δr118.J/mol*KHPMSTang, Lian, et al., 1976gas phase; M

(Strontium ion (1+) • 4Water) + Water = (Strontium ion (1+) • 5Water)

By formula: (Sr+ • 4H2O) + H2O = (Sr+ • 5H2O)

Quantity Value Units Method Reference Comment
Δr86.2kJ/molHPMSTang, Lian, et al., 1976gas phase; M
Quantity Value Units Method Reference Comment
Δr128.J/mol*KHPMSTang, Lian, et al., 1976gas phase; M

(Strontium ion (1+) • 5Water) + Water = (Strontium ion (1+) • 6Water)

By formula: (Sr+ • 5H2O) + H2O = (Sr+ • 6H2O)

Quantity Value Units Method Reference Comment
Δr76.6kJ/molHPMSTang, Lian, et al., 1976gas phase; M
Quantity Value Units Method Reference Comment
Δr128.J/mol*KHPMSTang, Lian, et al., 1976gas phase; M

(Strontium ion (1+) • 6Water) + Water = (Strontium ion (1+) • 7Water)

By formula: (Sr+ • 6H2O) + H2O = (Sr+ • 7H2O)

Quantity Value Units Method Reference Comment
Δr72.4kJ/molHPMSTang, Lian, et al., 1976gas phase; M
Quantity Value Units Method Reference Comment
Δr144.J/mol*KHPMSTang, Lian, et al., 1976gas phase; M

(Strontium ion (1+) • 7Water) + Water = (Strontium ion (1+) • 8Water)

By formula: (Sr+ • 7H2O) + H2O = (Sr+ • 8H2O)

Quantity Value Units Method Reference Comment
Δr68.6kJ/molHPMSTang, Lian, et al., 1976gas phase; M
Quantity Value Units Method Reference Comment
Δr157.J/mol*KHPMSTang, Lian, et al., 1976gas phase; M

(Strontium ion (1+) • Water) + Water = (Strontium ion (1+) • 2Water)

By formula: (Sr+ • H2O) + H2O = (Sr+ • 2H2O)

Quantity Value Units Method Reference Comment
Δr128.kJ/molHPMSTang, Lian, et al., 1976gas phase; M
Quantity Value Units Method Reference Comment
Δr118.J/mol*KHPMSTang, Lian, et al., 1976gas phase; M

Strontium ion (1+) + Water = (Strontium ion (1+) • Water)

By formula: Sr+ + H2O = (Sr+ • H2O)

Quantity Value Units Method Reference Comment
Δr144.kJ/molHPMSTang, Lian, et al., 1976gas phase; M
Quantity Value Units Method Reference Comment
Δr130.J/mol*KHPMSTang, Lian, et al., 1976gas phase; M

Strontium ion (1+) + Mesitylene = (Strontium ion (1+) • Mesitylene)

By formula: Sr+ + C9H12 = (Sr+ • C9H12)

Quantity Value Units Method Reference Comment
Δr116.kJ/molRAKGapeev and Dunbar, 2000RCD

References

Chase, 1998
Chase, M.W., Jr.,
NIST-JANAF Themochemical Tables, Fourth Edition,
J. Phys. Chem. Ref. Data, Monograph 9, 1998, 1-1951. [all data]
Gapeev and Dunbar, 2000
Gapeev, A.; Dunbar, R.C.,
Binding of Alkaline Earth Halide Ions MX+ to Benzene and Mesitylene,
J. Am. Soc. Mass Spectrom., 2000, 13, 5, 477, https://doi.org/10.1016/S1044-0305(02)00373-2
. [all data]
Tang, Lian, et al., 1976
Tang, I.N.; Lian, M.S.; Castleman, A.W.,
Mass Spectrometric Study of Gas - Phase Clustering Reactions: Hydration of the Monovalent Strontium Ion,
J. Chem. Phys., 1976, 65, 10, 4022, https://doi.org/10.1063/1.432854
. [all data]