N,N-dihexyl hexanamide
- Formula: C18H37NO
- Molecular weight: 283.4925
- CAS Registry Number: 146985-21-9

Phase change data

Data compiled by: William E. Acree, Jr., James S. Chickos
Quantity | Value | Units | Method | Reference | Comment |
---|---|---|---|---|---|
ΔvapH° | 80.4 ± 1.6 | kJ/mol | CGC | Panneerselvam, Antony, et al., 2009 | Based on data from 463. to 513. K. |
ΔvapH° | 79.1 ± 0.9 | kJ/mol | CGC | Panneerselvam, Antony, et al., 2009 | Based on data from 463. to 513. K. |

References

Panneerselvam, Antony, et al., 2009
Panneerselvam, K.; Antony, M.P.; Srinivasan, T.G.; Vasudeva Rao, P.R.,
Enthalpies of vaporization of N,N-dialkyl monamides at 298.15K,
Thermochimica Acta, 2009, 495, 1-2, 1-4, https://doi.org/10.1016/j.tca.2009.05.007
. [all data]