(R)-1,2-dipalmitoyloxypropyl-3-arsonic acid

Phase change data

Data compiled by: William E. Acree, Jr., James S. Chickos

Enthalpy of fusion

ΔfusH (kJ/mol) Temperature (K) Method Reference
250.6377.3DSCServes, Tsivgoulis, et al., 1992

References

Serves, Tsivgoulis, et al., 1992
Serves, Spyros V.; Tsivgoulis, Gerasimos M.; Sotiropoulos, Demetrios N.; Ioannou, Panayiotis V.; Jain, Mahendra K., SYNTHESIS OF (R)- AND (S)-1,2-DIACYLOXYPROPYL-3-ARSONIC ACIDS: OPTICALLY ACTIVE ARSONOLIPIDS, Phosphorus, Sulfur, and Silicon and the Related Elements, 1992, 71, 1-4, 99-105, https://doi.org/10.1080/10426509208034501 . [all data]