Benzene, 1,3,5-trimethyl-2-(1-methylethenyl)-
- Formula: C12H16
- Molecular weight: 160.2554
- IUPAC Standard InChIKey: KNMWUHBKZHDEOQ-UHFFFAOYSA-N
- CAS Registry Number: 14679-13-1
- Chemical structure:
View 3d structure (requires JavaScript / HTML 5) - Permanent link for this species. Use this link for bookmarking this species for future reference.

Phase change data

Data compiled by: Thermodynamics Research Center, NIST Boulder Laboratories, Chris Muzny director
Quantity | Value | Units | Method | Reference | Comment |
---|---|---|---|---|---|
Tboil | 484.3 | K | N/A | Anonymous, 1953 | Uncertainty assigned by TRC = 0.2 K |
Quantity | Value | Units | Method | Reference | Comment |
Tfus | 241.55 | K | N/A | Anonymous, 1953 | Uncertainty assigned by TRC = 0.2 K |

Normal alkane RI, non-polar column, temperature ramp

Column type | Active phase | I | Reference | Comment |
---|---|---|---|---|
Capillary | OV-101 | 1311. | Zenkevich, 2001 | N2, 4. K/min; Column length: 25. m; Column diameter: 0.20 mm; Tstart: 60. C; Tend: 240. C |

References

Anonymous, 1953
Anonymous, R.,
, Physical Properties of Chemical Substances, Dow Chemical Company, 1953. [all data]
Zenkevich, 2001
Zenkevich, I.G.,
Interpretation of Gas Chromatographic Retention Indices in estimation of Structures of Isomeric Products of Radical Chlorinating of Alkyl Arenes,
Zh. Org. Khim., 2001, 37, 2, 283-293. [all data]